Loading...

First recorded build

 
All history
 

Last recorded build

[05:41:32]TeamCity server version is 2022.04.4 (build 108763)
[05:41:32]Collecting changes in 1 VCS root
[05:41:32][Collecting changes in 1 VCS root] VCS Root details
[05:41:32][VCS Root details] "minecraft-dev/MinecraftDev" {instance id=90, parent internal id=19, parent id=MinecraftDev, description: "https://github.com/minecraft-dev/MinecraftDev.git#refs/heads/dev"}
[05:41:32][Collecting changes in 1 VCS root] Loading current repository state for VCS root 'minecraft-dev/MinecraftDev'
[05:41:32][Loading current repository state for VCS root 'minecraft-dev/MinecraftDev'] VCS root 'minecraft-dev/MinecraftDev': git -c credential.helper= ls-remote origin
[05:41:32][Collecting changes in 1 VCS root] Detecting changes in VCS root 'minecraft-dev/MinecraftDev' (used in 'Build')
[05:41:32][Collecting changes in 1 VCS root] Will collect changes for 'minecraft-dev/MinecraftDev' starting from revision 636f924bcc9c00a3b7137b9912248c0dd03588a9
[05:41:33][Collecting changes in 1 VCS root] Compute revision for 'minecraft-dev/MinecraftDev'
[05:41:33][Compute revision for 'minecraft-dev/MinecraftDev'] Upper limit revision: fe32c4de0d3ab4c08b755965ce5e733d505bee00
[05:41:33][Compute revision for 'minecraft-dev/MinecraftDev'] MaxModId = 8178
[05:41:33][Compute revision for 'minecraft-dev/MinecraftDev'] The first revision that was detected in the branch refs/heads/license-change: fe32c4de0d3ab4c08b755965ce5e733d505bee00
[05:41:33][Compute revision for 'minecraft-dev/MinecraftDev'] Latest commit attached to build configuration (with id <= 8178): fe32c4de0d3ab4c08b755965ce5e733d505bee00
[05:41:33][Compute revision for 'minecraft-dev/MinecraftDev'] Computed revision: fe32c4de0d3ab4c08b755965ce5e733d505bee00
[05:41:33]The build is removed from the queue to be prepared for the start
[05:41:33]Starting the build on the agent "Linux Agent 1"
[05:41:33]Agent time zone: Etc/UTC
[05:41:33]Agent is running under JRE: 11.0.16.1+1
[05:41:33]Updating tools for build
[05:41:33][Updating tools for build] Tools are not required for the build
[05:41:33]Clearing temporary directory: /opt/teamcity/agents/BuildAgent1/temp/buildTmp
[05:41:33]Publishing internal artifacts
[05:41:33][Publishing internal artifacts] Publishing 1 file using [WebPublisher]
[05:41:33][Publishing internal artifacts] Publishing 1 file using [ArtifactsCachePublisherImpl]
[05:41:33]Clean build enabled: removing old files from /opt/teamcity/agents/BuildAgent1/work/1d03b78f1535a6b5
[05:41:33]Checkout directory: /opt/teamcity/agents/BuildAgent1/work/1d03b78f1535a6b5
[05:41:33]Updating sources: auto checkout (on agent) (1s)
[05:41:33][Updating sources] Will use agent side checkout
[05:41:33][Updating sources] Full checkout enforced. Reason: ["Delete all files before the build" turned on]
[05:41:33][Updating sources] VCS Root: minecraft-dev/MinecraftDev (1s)
[05:41:33][VCS Root: minecraft-dev/MinecraftDev] revision: fe32c4de0d3ab4c08b755965ce5e733d505bee00
[05:41:33][VCS Root: minecraft-dev/MinecraftDev] Mirrors enabled via VCS root settings
[05:41:33][VCS Root: minecraft-dev/MinecraftDev] Git version: 2.37.3.0
[05:41:33][VCS Root: minecraft-dev/MinecraftDev] Update git mirror (/opt/teamcity/agents/BuildAgent1/system/git/git-1D628950.git) (1s)
[05:41:33][Update git mirror (/opt/teamcity/agents/BuildAgent1/system/git/git-1D628950.git)] /usr/bin/git config http.sslCAInfo
[05:41:33][Update git mirror (/opt/teamcity/agents/BuildAgent1/system/git/git-1D628950.git)] /usr/bin/git show-ref
[05:41:33][Update git mirror (/opt/teamcity/agents/BuildAgent1/system/git/git-1D628950.git)] /usr/bin/git -c credential.helper= ls-remote origin
[05:41:33][Update git mirror (/opt/teamcity/agents/BuildAgent1/system/git/git-1D628950.git)] /usr/bin/git show-ref refs/heads/license-change
[05:41:33][Update git mirror (/opt/teamcity/agents/BuildAgent1/system/git/git-1D628950.git)] show-ref command failed, empty result will be returned: /usr/bin/git show-ref refs/heads/license-change command failed. exit code: 1
[05:41:33][Update git mirror (/opt/teamcity/agents/BuildAgent1/system/git/git-1D628950.git)] 'git fetch' required: 'refs/heads/license-change' is not found in the local repository clone.
[05:41:33][Update git mirror (/opt/teamcity/agents/BuildAgent1/system/git/git-1D628950.git)] /usr/bin/git -c credential.helper= fetch --progress --recurse-submodules=no origin +refs/heads/license-change:refs/heads/license-change
[05:41:34][/usr/bin/git -c credential.helper= fetch --progress --recurse-submodules=no origin +refs/heads/license-change:refs/heads/license-change] remote: Enumerating objects: 5, done.
[05:41:34][/usr/bin/git -c credential.helper= fetch --progress --recurse-submodules=no origin +refs/heads/license-change:refs/heads/license-change] remote: Counting objects: 20% (1/5)
[05:41:34][/usr/bin/git -c credential.helper= fetch --progress --recurse-submodules=no origin +refs/heads/license-change:refs/heads/license-change] remote: Counting objects: 40% (2/5)
[05:41:34][/usr/bin/git -c credential.helper= fetch --progress --recurse-submodules=no origin +refs/heads/license-change:refs/heads/license-change] remote: Counting objects: 60% (3/5)
[05:41:34][/usr/bin/git -c credential.helper= fetch --progress --recurse-submodules=no origin +refs/heads/license-change:refs/heads/license-change] remote: Counting objects: 80% (4/5)
[05:41:34][/usr/bin/git -c credential.helper= fetch --progress --recurse-submodules=no origin +refs/heads/license-change:refs/heads/license-change] remote: Counting objects: 100% (5/5)
[05:41:34][/usr/bin/git -c credential.helper= fetch --progress --recurse-submodules=no origin +refs/heads/license-change:refs/heads/license-change] remote: Counting objects: 100% (5/5), done.
[05:41:34][/usr/bin/git -c credential.helper= fetch --progress --recurse-submodules=no origin +refs/heads/license-change:refs/heads/license-change] remote: Compressing objects: 25% (1/4)
[05:41:34][/usr/bin/git -c credential.helper= fetch --progress --recurse-submodules=no origin +refs/heads/license-change:refs/heads/license-change] remote: Compressing objects: 50% (2/4)
[05:41:34][/usr/bin/git -c credential.helper= fetch --progress --recurse-submodules=no origin +refs/heads/license-change:refs/heads/license-change] remote: Compressing objects: 75% (3/4)
[05:41:34][/usr/bin/git -c credential.helper= fetch --progress --recurse-submodules=no origin +refs/heads/license-change:refs/heads/license-change] remote: Compressing objects: 100% (4/4)
[05:41:34][/usr/bin/git -c credential.helper= fetch --progress --recurse-submodules=no origin +refs/heads/license-change:refs/heads/license-change] remote: Compressing objects: 100% (4/4), done.
[05:41:34][/usr/bin/git -c credential.helper= fetch --progress --recurse-submodules=no origin +refs/heads/license-change:refs/heads/license-change] remote: Total 5 (delta 1), reused 5 (delta 1), pack-reused 0
[05:41:34][/usr/bin/git -c credential.helper= fetch --progress --recurse-submodules=no origin +refs/heads/license-change:refs/heads/license-change] From https://github.com/minecraft-dev/MinecraftDev
[05:41:34][/usr/bin/git -c credential.helper= fetch --progress --recurse-submodules=no origin +refs/heads/license-change:refs/heads/license-change] * [new branch] license-change -> license-change
[05:41:34][/usr/bin/git -c credential.helper= fetch --progress --recurse-submodules=no origin +refs/heads/license-change:refs/heads/license-change] * [new branch] license-change -> origin/license-change
[05:41:34][Update git mirror (/opt/teamcity/agents/BuildAgent1/system/git/git-1D628950.git)] /usr/bin/git log -n1 --pretty=format:%H%x20%s fe32c4de0d3ab4c08b755965ce5e733d505bee00 --
[05:41:34][Update git mirror (/opt/teamcity/agents/BuildAgent1/system/git/git-1D628950.git)] /usr/bin/git pack-refs --all
[05:41:34][VCS Root: minecraft-dev/MinecraftDev] Update checkout directory (/opt/teamcity/agents/BuildAgent1/work/1d03b78f1535a6b5)
[05:41:34][Update checkout directory (/opt/teamcity/agents/BuildAgent1/work/1d03b78f1535a6b5)] The .git directory is missing in '/opt/teamcity/agents/BuildAgent1/work/1d03b78f1535a6b5'. Running 'git init'...
[05:41:34][Update checkout directory (/opt/teamcity/agents/BuildAgent1/work/1d03b78f1535a6b5)] /usr/bin/git init --initial-branch=main
[05:41:34][Update checkout directory (/opt/teamcity/agents/BuildAgent1/work/1d03b78f1535a6b5)] /usr/bin/git config lfs.storage /opt/teamcity/agents/BuildAgent1/system/git/git-1D628950.git/lfs
[05:41:34][Update checkout directory (/opt/teamcity/agents/BuildAgent1/work/1d03b78f1535a6b5)] /usr/bin/git config core.sparseCheckout true
[05:41:34][Update checkout directory (/opt/teamcity/agents/BuildAgent1/work/1d03b78f1535a6b5)] /usr/bin/git config http.sslCAInfo
[05:41:34][Update checkout directory (/opt/teamcity/agents/BuildAgent1/work/1d03b78f1535a6b5)] /usr/bin/git show-ref
[05:41:34][Update checkout directory (/opt/teamcity/agents/BuildAgent1/work/1d03b78f1535a6b5)] /usr/bin/git show-ref refs/remotes/origin/license-change
[05:41:34][Update checkout directory (/opt/teamcity/agents/BuildAgent1/work/1d03b78f1535a6b5)] /usr/bin/git log -n1 --pretty=format:%H%x20%s fe32c4de0d3ab4c08b755965ce5e733d505bee00 --
[05:41:34][Update checkout directory (/opt/teamcity/agents/BuildAgent1/work/1d03b78f1535a6b5)] No 'git fetch' required: commit 'fe32c4de0d3ab4c08b755965ce5e733d505bee00' is in the local repository clone pointed by 'refs/remotes/origin/license-change'.
[05:41:34][Update checkout directory (/opt/teamcity/agents/BuildAgent1/work/1d03b78f1535a6b5)] /usr/bin/git branch
[05:41:34][Update checkout directory (/opt/teamcity/agents/BuildAgent1/work/1d03b78f1535a6b5)] /usr/bin/git update-ref refs/heads/license-change fe32c4de0d3ab4c08b755965ce5e733d505bee00
[05:41:34][Update checkout directory (/opt/teamcity/agents/BuildAgent1/work/1d03b78f1535a6b5)] /usr/bin/git -c credential.helper= checkout -q -f license-change
[05:41:34][Update checkout directory (/opt/teamcity/agents/BuildAgent1/work/1d03b78f1535a6b5)] /usr/bin/git branch --set-upstream-to=refs/remotes/origin/license-change
[05:41:34][Update checkout directory (/opt/teamcity/agents/BuildAgent1/work/1d03b78f1535a6b5)] Cleaning minecraft-dev/MinecraftDev in /opt/teamcity/agents/BuildAgent1/work/1d03b78f1535a6b5 the file set ALL_UNTRACKED
[05:41:34][Update checkout directory (/opt/teamcity/agents/BuildAgent1/work/1d03b78f1535a6b5)] /usr/bin/git clean -f -d -x
[05:41:34]Step 1/1: Build (Gradle) (1m:29s)
[05:41:35][Step 1/1] Starting: bash /opt/teamcity/agents/BuildAgent1/work/1d03b78f1535a6b5/gradlew --init-script /opt/teamcity/agents/BuildAgent1/plugins/gradle-runner/scripts/init.gradle -Dorg.gradle.jvmargs=-Xmx4096m -Dorg.gradle.daemon=false -s -b build.gradle.kts build
[05:41:35][Step 1/1] in directory: /opt/teamcity/agents/BuildAgent1/work/1d03b78f1535a6b5
[05:41:35][Step 1/1] To honour the JVM settings for this build a single-use Daemon process will be forked. See https://docs.gradle.org/7.5.1/userguide/gradle_daemon.html#sec:disabling_the_daemon.
[05:41:37][Step 1/1] Daemon will be stopped at the end of the build
[05:41:40][Step 1/1] Type-safe project accessors is an incubating feature.
[05:41:44][Step 1/1] > Task :buildSrc:generateExternalPluginSpecBuilders
[05:41:44][Step 1/1] > Task :buildSrc:extractPrecompiledScriptPluginPlugins
[05:41:48][Step 1/1] > Task :buildSrc:compilePluginsBlocks
[05:41:48][Step 1/1] > Task :buildSrc:generatePrecompiledScriptPluginAccessors
[05:41:48][Step 1/1] > Task :buildSrc:generateScriptPluginAdapters
[05:41:49][Step 1/1] > Task :buildSrc:pluginDescriptors
[05:41:49][Step 1/1] > Task :buildSrc:processResources
[05:41:49][Step 1/1] > Task :buildSrc:processTestResources NO-SOURCE
[05:41:56][Step 1/1] > Task :buildSrc:compileKotlin
[05:41:56][Step 1/1] > Task :buildSrc:compileJava NO-SOURCE
[05:41:56][Step 1/1] > Task :buildSrc:compileGroovy NO-SOURCE
[05:41:56][Step 1/1] > Task :buildSrc:classes
[05:41:56][Step 1/1] > Task :buildSrc:inspectClassesForKotlinIC
[05:41:56][Step 1/1] > Task :buildSrc:jar
[05:41:56][Step 1/1] > Task :buildSrc:assemble
[05:41:56][Step 1/1] > Task :buildSrc:compileTestKotlin NO-SOURCE
[05:41:56][Step 1/1] > Task :buildSrc:pluginUnderTestMetadata
[05:41:56][Step 1/1] > Task :buildSrc:compileTestJava NO-SOURCE
[05:41:56][Step 1/1] > Task :buildSrc:compileTestGroovy NO-SOURCE
[05:41:56][Step 1/1] > Task :buildSrc:testClasses UP-TO-DATE
[05:41:56][Step 1/1] > Task :buildSrc:test NO-SOURCE
[05:41:56][Step 1/1] > Task :buildSrc:validatePlugins
[05:41:56][Step 1/1] > Task :buildSrc:check
[05:41:56][Step 1/1] > Task :buildSrc:build
[05:41:59][Step 1/1]
[05:41:59][Step 1/1] > Configure project :
[05:41:59][Step 1/1] Starting Gradle in TeamCity build 2152
[05:42:02][Step 1/1]
[05:42:02][Step 1/1] > Task :compileGradle-tooling-extensionKotlin NO-SOURCE
[05:42:02][Step 1/1] :compileGradle-tooling-extensionKotlin NO-SOURCE
[05:42:04][Step 1/1]
[05:42:04][Step 1/1] > Task :compileGradleToolingExtensionJava
[05:42:04][Step 1/1] :compileGradleToolingExtensionJava (1s)
[05:42:07][Step 1/1] > Task :compileGradleToolingExtensionGroovy
[05:42:07][Step 1/1] :compileGradleToolingExtensionGroovy
[05:42:07][Step 1/1] > Task :processGradleToolingExtensionResources
[05:42:07][Step 1/1] :processGradleToolingExtensionResources
[05:42:07][Step 1/1] > Task :gradleToolingExtensionClasses
[05:42:07][Step 1/1] :gradleToolingExtensionClasses
[05:42:07][Step 1/1] > Task :gradleToolingExtensionJar
[05:42:07][Step 1/1] :gradleToolingExtensionJar
[05:42:09][Step 1/1]
[05:42:09][Step 1/1] > Task :generateAtLexer
[05:42:09][Step 1/1] :generateAtLexer
[05:42:09][:generateAtLexer] Reading skeleton file "/home/teamcity/.gradle/caches/modules-2/files-2.1/org.jetbrains.idea/jflex/1.7.0-c1fdf11/9179bf379ca3b09f2209a75fb2e29b844d1f33df/jflex-1.7.0-c1fdf11.skeleton".
[05:42:09][:generateAtLexer] Reading "/opt/teamcity/agents/BuildAgent1/work/1d03b78f1535a6b5/src/main/grammars/AtLexer.flex"
[05:42:09][:generateAtLexer] Constructing NFA : 190 states in NFA
[05:42:09][:generateAtLexer] Converting NFA to DFA :
[05:42:09][:generateAtLexer] ..................................................................
[05:42:09][:generateAtLexer] 74 states before minimization, 58 states in minimized DFA
[05:42:09][:generateAtLexer] Writing code to "/opt/teamcity/agents/BuildAgent1/work/1d03b78f1535a6b5/build/gen/com/demonwav/mcdev/platform/mcp/at/gen/AtLexer.java"
[05:42:10][Step 1/1] > Task :generateAtParser
[05:42:10][Step 1/1] :generateAtParser
[05:42:10][:generateAtParser] AtParser.bnf parser generated to /opt/teamcity/agents/BuildAgent1/work/1d03b78f1535a6b5/build/gen
[05:42:12][Step 1/1] > Task :generateAwLexer
[05:42:12][Step 1/1] :generateAwLexer
[05:42:12][:generateAwLexer] Reading skeleton file "/home/teamcity/.gradle/caches/modules-2/files-2.1/org.jetbrains.idea/jflex/1.7.0-c1fdf11/9179bf379ca3b09f2209a75fb2e29b844d1f33df/jflex-1.7.0-c1fdf11.skeleton".
[05:42:12][:generateAwLexer] Reading "/opt/teamcity/agents/BuildAgent1/work/1d03b78f1535a6b5/src/main/grammars/AwLexer.flex"
[05:42:12][:generateAwLexer] Constructing NFA : 402 states in NFA
[05:42:12][:generateAwLexer] Converting NFA to DFA :
[05:42:12][:generateAwLexer] ..............................................................................................................................................
[05:42:12][:generateAwLexer] 152 states before minimization, 110 states in minimized DFA
[05:42:12][:generateAwLexer] Writing code to "/opt/teamcity/agents/BuildAgent1/work/1d03b78f1535a6b5/build/gen/com/demonwav/mcdev/platform/mcp/aw/gen/AwLexer.java"
[05:42:13][Step 1/1] > Task :generateAwParser
[05:42:13][Step 1/1] :generateAwParser
[05:42:13][:generateAwParser] AwParser.bnf parser generated to /opt/teamcity/agents/BuildAgent1/work/1d03b78f1535a6b5/build/gen
[05:42:14][Step 1/1]
[05:42:14][Step 1/1] > Task :generateLangLexer
[05:42:14][Step 1/1] :generateLangLexer
[05:42:14][:generateLangLexer] Reading skeleton file "/home/teamcity/.gradle/caches/modules-2/files-2.1/org.jetbrains.idea/jflex/1.7.0-c1fdf11/9179bf379ca3b09f2209a75fb2e29b844d1f33df/jflex-1.7.0-c1fdf11.skeleton".
[05:42:14][:generateLangLexer] Reading "/opt/teamcity/agents/BuildAgent1/work/1d03b78f1535a6b5/src/main/grammars/LangLexer.flex"
[05:42:14][:generateLangLexer] Constructing NFA : 50 states in NFA
[05:42:14][:generateLangLexer] Converting NFA to DFA :
[05:42:14][:generateLangLexer] ...............
[05:42:14][:generateLangLexer] 21 states before minimization, 13 states in minimized DFA
[05:42:14][:generateLangLexer] Writing code to "/opt/teamcity/agents/BuildAgent1/work/1d03b78f1535a6b5/build/gen/com/demonwav/mcdev/translations/lang/gen/LangLexer.java"
[05:42:14][Step 1/1] > Task :generateLangParser
[05:42:14][Step 1/1] :generateLangParser
[05:42:14][:generateLangParser] LangParser.bnf parser generated to /opt/teamcity/agents/BuildAgent1/work/1d03b78f1535a6b5/build/gen
[05:42:16][Step 1/1] > Task :generateNbttLexer
[05:42:16][Step 1/1] :generateNbttLexer
[05:42:16][:generateNbttLexer] Reading skeleton file "/home/teamcity/.gradle/caches/modules-2/files-2.1/org.jetbrains.idea/jflex/1.7.0-c1fdf11/9179bf379ca3b09f2209a75fb2e29b844d1f33df/jflex-1.7.0-c1fdf11.skeleton".
[05:42:16][:generateNbttLexer] Reading "/opt/teamcity/agents/BuildAgent1/work/1d03b78f1535a6b5/src/main/grammars/NbttLexer.flex"
[05:42:16][:generateNbttLexer] Constructing NFA : 1,366 states in NFA
[05:42:16][:generateNbttLexer] Converting NFA to DFA :
[05:42:16][:generateNbttLexer] ....................................................................................................................................................................................................................................................................................................................................................................................................................................................................................
[05:42:16][:generateNbttLexer] 480 states before minimization, 318 states in minimized DFA
[05:42:16][:generateNbttLexer] Writing code to "/opt/teamcity/agents/BuildAgent1/work/1d03b78f1535a6b5/build/gen/com/demonwav/mcdev/nbt/lang/gen/NbttLexer.java"
[05:42:17][Step 1/1] > Task :generateNbttParser
[05:42:17][Step 1/1] :generateNbttParser
[05:42:17][:generateNbttParser] NbttParser.bnf parser generated to /opt/teamcity/agents/BuildAgent1/work/1d03b78f1535a6b5/build/gen
[05:42:18][Step 1/1] > Task :generateTranslationTemplateLexer
[05:42:18][Step 1/1] :generateTranslationTemplateLexer
[05:42:18][:generateTranslationTemplateLexer] Reading skeleton file "/home/teamcity/.gradle/caches/modules-2/files-2.1/org.jetbrains.idea/jflex/1.7.0-c1fdf11/9179bf379ca3b09f2209a75fb2e29b844d1f33df/jflex-1.7.0-c1fdf11.skeleton".
[05:42:18][:generateTranslationTemplateLexer] Reading "/opt/teamcity/agents/BuildAgent1/work/1d03b78f1535a6b5/src/main/grammars/TranslationTemplateLexer.flex"
[05:42:18][:generateTranslationTemplateLexer] Constructing NFA : 30 states in NFA
[05:42:18][:generateTranslationTemplateLexer] Converting NFA to DFA :
[05:42:18][:generateTranslationTemplateLexer] ..........
[05:42:18][:generateTranslationTemplateLexer] 16 states before minimization, 6 states in minimized DFA
[05:42:18][:generateTranslationTemplateLexer] Writing code to "/opt/teamcity/agents/BuildAgent1/work/1d03b78f1535a6b5/build/gen/com/demonwav/mcdev/translations/lang/gen/TranslationTemplateLexer.java"
[05:42:18][Step 1/1] > Task :generate
[05:42:18][Step 1/1] :generate
[05:42:18][Step 1/1] > Task :setupDependencies
[05:42:18][Step 1/1] :setupDependencies
[05:42:18][Step 1/1] > Task :patchPluginXml
[05:42:18][Step 1/1] :patchPluginXml
[05:42:18][Step 1/1] > Task :verifyPluginConfiguration
[05:42:18][Step 1/1] :verifyPluginConfiguration
[05:42:18][:verifyPluginConfiguration] [gradle-intellij-plugin :MinecraftDev:verifyPluginConfiguration] The following plugin configuration issues were found:
[05:42:18][:verifyPluginConfiguration] - The dependency on the Kotlin Standard Library (stdlib) is automatically added when using the Gradle Kotlin plugin and may conflict with the version provided with the IntelliJ Platform, see: https://jb.gg/intellij-platform-kotlin-stdlib
[05:42:18][:verifyPluginConfiguration] See: https://jb.gg/intellij-platform-versions
[05:42:19][Step 1/1]
[05:42:19][Step 1/1] > Task :processResources
[05:42:19][Step 1/1] :processResources
[05:42:19][Step 1/1] > Task :setupInstrumentCode
[05:42:19][Step 1/1] :setupInstrumentCode
[05:42:19][Step 1/1] > Task :checkLicenseCustomBuildSrc FAILED
[05:42:19][Step 1/1] :checkLicenseCustomBuildSrc
[05:42:20][Step 1/1] > Task :compileKotlin
[05:42:20][Step 1/1] :compileKotlin (43s)
[05:43:03][:compileKotlin] w: ATTENTION!
[05:43:03][:compileKotlin] This build uses experimental K2 compiler:
[05:43:03][:compileKotlin] -Xuse-k2
[05:43:04][Step 1/1] Execution failed for task ':checkLicenseCustomBuildSrc'. org.cadixdev.gradle.licenser.LicenseViolationException: License violations were found: buildSrc/src/main/kotlin/mcdev.gradle.kts, buildSrc/src/main/kotlin/Filter.kt, buildSrc/src/main/kotlin/util.kt, buildSrc/build.gradle.kts, buildSrc/settings.gradle.kts
[05:43:04][Step 1/1] Deprecated Gradle features were used in this build, making it incompatible with Gradle 8.0.
[05:43:04][Step 1/1]
[05:43:04][Step 1/1] You can use '--warning-mode all' to show the individual deprecation warnings and determine if they come from your own scripts or plugins.
[05:43:04][Step 1/1]
[05:43:04][Step 1/1] 32 actionable tasks: 32 executed
[05:43:04][Step 1/1] Process exited with code 1
[05:43:04][Step 1/1] Gradle failure report
[05:43:04][Gradle failure report] FAILURE: Build completed with 2 failures.
[05:43:04][Gradle failure report]
[05:43:04][Gradle failure report] 1: Task failed with an exception.
[05:43:04][Gradle failure report] -----------
[05:43:04][Gradle failure report] * What went wrong:
[05:43:04][Gradle failure report] Execution failed for task ':checkLicenseCustomBuildSrc'.
[05:43:04][Gradle failure report] > License violations were found: buildSrc/src/main/kotlin/mcdev.gradle.kts, buildSrc/src/main/kotlin/Filter.kt, buildSrc/src/main/kotlin/util.kt, buildSrc/build.gradle.kts, buildSrc/settings.gradle.kts
[05:43:04][Gradle failure report]
[05:43:04][Gradle failure report] * Try:
[05:43:04][Gradle failure report] > Run with --info or --debug option to get more log output.
[05:43:04][Gradle failure report] > Run with --scan to get full insights.
[05:43:04][Gradle failure report]
[05:43:04][Gradle failure report] * Exception is:
[05:43:04][Gradle failure report] org.gradle.api.tasks.TaskExecutionException: Execution failed for task ':checkLicenseCustomBuildSrc'.
[05:43:04][Gradle failure report] at org.gradle.api.internal.tasks.execution.ExecuteActionsTaskExecuter.lambda$executeIfValid$1(ExecuteActionsTaskExecuter.java:142)
[05:43:04][Gradle failure report] at org.gradle.internal.Try$Failure.ifSuccessfulOrElse(Try.java:282)
[05:43:04][Gradle failure report] at org.gradle.api.internal.tasks.execution.ExecuteActionsTaskExecuter.executeIfValid(ExecuteActionsTaskExecuter.java:140)
[05:43:04][Gradle failure report] at org.gradle.api.internal.tasks.execution.ExecuteActionsTaskExecuter.execute(ExecuteActionsTaskExecuter.java:128)
[05:43:04][Gradle failure report] at org.gradle.api.internal.tasks.execution.CleanupStaleOutputsExecuter.execute(CleanupStaleOutputsExecuter.java:77)
[05:43:04][Gradle failure report] at org.gradle.api.internal.tasks.execution.FinalizePropertiesTaskExecuter.execute(FinalizePropertiesTaskExecuter.java:46)
[05:43:04][Gradle failure report] at org.gradle.api.internal.tasks.execution.ResolveTaskExecutionModeExecuter.execute(ResolveTaskExecutionModeExecuter.java:51)
[05:43:04][Gradle failure report] at org.gradle.api.internal.tasks.execution.SkipTaskWithNoActionsExecuter.execute(SkipTaskWithNoActionsExecuter.java:57)
[05:43:04][Gradle failure report] at org.gradle.api.internal.tasks.execution.SkipOnlyIfTaskExecuter.execute(SkipOnlyIfTaskExecuter.java:56)
[05:43:04][Gradle failure report] at org.gradle.api.internal.tasks.execution.CatchExceptionTaskExecuter.execute(CatchExceptionTaskExecuter.java:36)
[05:43:04][Gradle failure report] at org.gradle.api.internal.tasks.execution.EventFiringTaskExecuter$1.executeTask(EventFiringTaskExecuter.java:77)
[05:43:04][Gradle failure report] at org.gradle.api.internal.tasks.execution.EventFiringTaskExecuter$1.call(EventFiringTaskExecuter.java:55)
[05:43:04][Gradle failure report] at org.gradle.api.internal.tasks.execution.EventFiringTaskExecuter$1.call(EventFiringTaskExecuter.java:52)
[05:43:04][Gradle failure report] at org.gradle.internal.operations.DefaultBuildOperationRunner$CallableBuildOperationWorker.execute(DefaultBuildOperationRunner.java:204)
[05:43:04][Gradle failure report] at org.gradle.internal.operations.DefaultBuildOperationRunner$CallableBuildOperationWorker.execute(DefaultBuildOperationRunner.java:199)
[05:43:04][Gradle failure report] at org.gradle.internal.operations.DefaultBuildOperationRunner$2.execute(DefaultBuildOperationRunner.java:66)
[05:43:04][Gradle failure report] at org.gradle.internal.operations.DefaultBuildOperationRunner$2.execute(DefaultBuildOperationRunner.java:59)
[05:43:04][Gradle failure report] at org.gradle.internal.operations.DefaultBuildOperationRunner.execute(DefaultBuildOperationRunner.java:157)
[05:43:04][Gradle failure report] at org.gradle.internal.operations.DefaultBuildOperationRunner.execute(DefaultBuildOperationRunner.java:59)
[05:43:04][Gradle failure report] at org.gradle.internal.operations.DefaultBuildOperationRunner.call(DefaultBuildOperationRunner.java:53)
[05:43:04][Gradle failure report] at org.gradle.internal.operations.DefaultBuildOperationExecutor.call(DefaultBuildOperationExecutor.java:73)
[05:43:04][Gradle failure report] at org.gradle.api.internal.tasks.execution.EventFiringTaskExecuter.execute(EventFiringTaskExecuter.java:52)
[05:43:04][Gradle failure report] at org.gradle.execution.plan.LocalTaskNodeExecutor.execute(LocalTaskNodeExecutor.java:69)
[05:43:04][Gradle failure report] at org.gradle.execution.taskgraph.DefaultTaskExecutionGraph$InvokeNodeExecutorsAction.execute(DefaultTaskExecutionGraph.java:327)
[05:43:04][Gradle failure report] at org.gradle.execution.taskgraph.DefaultTaskExecutionGraph$InvokeNodeExecutorsAction.execute(DefaultTaskExecutionGraph.java:314)
[05:43:04][Gradle failure report] at org.gradle.execution.taskgraph.DefaultTaskExecutionGraph$BuildOperationAwareExecutionAction.execute(DefaultTaskExecutionGraph.java:307)
[05:43:04][Gradle failure report] at org.gradle.execution.taskgraph.DefaultTaskExecutionGraph$BuildOperationAwareExecutionAction.execute(DefaultTaskExecutionGraph.java:293)
[05:43:04][Gradle failure report] at org.gradle.execution.plan.DefaultPlanExecutor$ExecutorWorker.execute(DefaultPlanExecutor.java:420)
[05:43:04][Gradle failure report] at org.gradle.execution.plan.DefaultPlanExecutor$ExecutorWorker.run(DefaultPlanExecutor.java:342)
[05:43:04][Gradle failure report] at org.gradle.internal.concurrent.ExecutorPolicy$CatchAndRecordFailures.onExecute(ExecutorPolicy.java:64)
[05:43:04][Gradle failure report] at org.gradle.internal.concurrent.ManagedExecutorImpl$1.run(ManagedExecutorImpl.java:48)
[05:43:04][Gradle failure report] Caused by: org.cadixdev.gradle.licenser.LicenseViolationException: License violations were found: buildSrc/src/main/kotlin/mcdev.gradle.kts, buildSrc/src/main/kotlin/Filter.kt, buildSrc/src/main/kotlin/util.kt, buildSrc/build.gradle.kts, buildSrc/settings.gradle.kts
[05:43:04][Gradle failure report] at java.base/jdk.internal.reflect.NativeConstructorAccessorImpl.newInstance0(Native Method)
[05:43:04][Gradle failure report] at java.base/jdk.internal.reflect.NativeConstructorAccessorImpl.newInstance(NativeConstructorAccessorImpl.java:62)
[05:43:04][Gradle failure report] at java.base/jdk.internal.reflect.DelegatingConstructorAccessorImpl.newInstance(DelegatingConstructorAccessorImpl.java:45)
[05:43:04][Gradle failure report] at org.gradle.internal.classpath.Instrumented$FileInputStreamConstructorCallSite.callConstructor(Instrumented.java:971)
[05:43:04][Gradle failure report] at org.cadixdev.gradle.licenser.tasks.LicenseCheck.checkFiles(LicenseCheck.groovy:83)
[05:43:04][Gradle failure report] at java.base/jdk.internal.reflect.NativeMethodAccessorImpl.invoke0(Native Method)
[05:43:04][Gradle failure report] at java.base/jdk.internal.reflect.NativeMethodAccessorImpl.invoke(NativeMethodAccessorImpl.java:62)
[05:43:04][Gradle failure report] at java.base/jdk.internal.reflect.DelegatingMethodAccessorImpl.invoke(DelegatingMethodAccessorImpl.java:43)
[05:43:04][Gradle failure report] at org.gradle.internal.reflect.JavaMethod.invoke(JavaMethod.java:125)
[05:43:04][Gradle failure report] at org.gradle.api.internal.project.taskfactory.StandardTaskAction.doExecute(StandardTaskAction.java:58)
[05:43:04][Gradle failure report] at org.gradle.api.internal.project.taskfactory.StandardTaskAction.execute(StandardTaskAction.java:51)
[05:43:04][Gradle failure report] at org.gradle.api.internal.project.taskfactory.StandardTaskAction.execute(StandardTaskAction.java:29)
[05:43:04][Gradle failure report] at org.gradle.api.internal.tasks.execution.TaskExecution$3.run(TaskExecution.java:236)
[05:43:04][Gradle failure report] at org.gradle.internal.operations.DefaultBuildOperationRunner$1.execute(DefaultBuildOperationRunner.java:29)
[05:43:04][Gradle failure report] at org.gradle.internal.operations.DefaultBuildOperationRunner$1.execute(DefaultBuildOperationRunner.java:26)
[05:43:04][Gradle failure report] at org.gradle.internal.operations.DefaultBuildOperationRunner$2.execute(DefaultBuildOperationRunner.java:66)
[05:43:04][Gradle failure report] at org.gradle.internal.operations.DefaultBuildOperationRunner$2.execute(DefaultBuildOperationRunner.java:59)
[05:43:04][Gradle failure report] at org.gradle.internal.operations.DefaultBuildOperationRunner.execute(DefaultBuildOperationRunner.java:157)
[05:43:04][Gradle failure report] at org.gradle.internal.operations.DefaultBuildOperationRunner.execute(DefaultBuildOperationRunner.java:59)
[05:43:04][Gradle failure report] at org.gradle.internal.operations.DefaultBuildOperationRunner.run(DefaultBuildOperationRunner.java:47)
[05:43:04][Gradle failure report] at org.gradle.internal.operations.DefaultBuildOperationExecutor.run(DefaultBuildOperationExecutor.java:68)
[05:43:04][Gradle failure report] at org.gradle.api.internal.tasks.execution.TaskExecution.executeAction(TaskExecution.java:221)
[05:43:04][Gradle failure report] at org.gradle.api.internal.tasks.execution.TaskExecution.executeActions(TaskExecution.java:204)
[05:43:04][Gradle failure report] at org.gradle.api.internal.tasks.execution.TaskExecution.executeWithPreviousOutputFiles(TaskExecution.java:187)
[05:43:04][Gradle failure report] at org.gradle.api.internal.tasks.execution.TaskExecution.execute(TaskExecution.java:165)
[05:43:04][Gradle failure report] at org.gradle.internal.execution.steps.ExecuteStep.executeInternal(ExecuteStep.java:89)
[05:43:04][Gradle failure report] at org.gradle.internal.execution.steps.ExecuteStep.access$000(ExecuteStep.java:40)
[05:43:04][Gradle failure report] at org.gradle.internal.execution.steps.ExecuteStep$1.call(ExecuteStep.java:53)
[05:43:04][Gradle failure report] at org.gradle.internal.execution.steps.ExecuteStep$1.call(ExecuteStep.java:50)
[05:43:04][Gradle failure report] at org.gradle.internal.operations.DefaultBuildOperationRunner$CallableBuildOperationWorker.execute(DefaultBuildOperationRunner.java:204)
[05:43:04][Gradle failure report] at org.gradle.internal.operations.DefaultBuildOperationRunner$CallableBuildOperationWorker.execute(DefaultBuildOperationRunner.java:199)
[05:43:04][Gradle failure report] at org.gradle.internal.operations.DefaultBuildOperationRunner$2.execute(DefaultBuildOperationRunner.java:66)
[05:43:04][Gradle failure report] at org.gradle.internal.operations.DefaultBuildOperationRunner$2.execute(DefaultBuildOperationRunner.java:59)
[05:43:04][Gradle failure report] at org.gradle.internal.operations.DefaultBuildOperationRunner.execute(DefaultBuildOperationRunner.java:157)
[05:43:04][Gradle failure report] at org.gradle.internal.operations.DefaultBuildOperationRunner.execute(DefaultBuildOperationRunner.java:59)
[05:43:04][Gradle failure report] at org.gradle.internal.operations.DefaultBuildOperationRunner.call(DefaultBuildOperationRunner.java:53)
[05:43:04][Gradle failure report] at org.gradle.internal.operations.DefaultBuildOperationExecutor.call(DefaultBuildOperationExecutor.java:73)
[05:43:04][Gradle failure report] at org.gradle.internal.execution.steps.ExecuteStep.execute(ExecuteStep.java:50)
[05:43:04][Gradle failure report] at org.gradle.internal.execution.steps.ExecuteStep.execute(ExecuteStep.java:40)
[05:43:04][Gradle failure report] at org.gradle.internal.execution.steps.RemovePreviousOutputsStep.execute(RemovePreviousOutputsStep.java:68)
[05:43:04][Gradle failure report] at org.gradle.internal.execution.steps.RemovePreviousOutputsStep.execute(RemovePreviousOutputsStep.java:38)
[05:43:04][Gradle failure report] at org.gradle.internal.execution.steps.CancelExecutionStep.execute(CancelExecutionStep.java:41)
[05:43:04][Gradle failure report] at org.gradle.internal.execution.steps.TimeoutStep.executeWithoutTimeout(TimeoutStep.java:74)
[05:43:04][Gradle failure report] at org.gradle.internal.execution.steps.TimeoutStep.execute(TimeoutStep.java:55)
[05:43:04][Gradle failure report] at org.gradle.internal.execution.steps.CreateOutputsStep.execute(CreateOutputsStep.java:51)
[05:43:04][Gradle failure report] at org.gradle.internal.execution.steps.CreateOutputsStep.execute(CreateOutputsStep.java:29)
[05:43:04][Gradle failure report] at org.gradle.internal.execution.steps.CaptureStateAfterExecutionStep.executeDelegateBroadcastingChanges(CaptureStateAfterExecutionStep.java:124)
[05:43:04][Gradle failure report] at org.gradle.internal.execution.steps.CaptureStateAfterExecutionStep.execute(CaptureStateAfterExecutionStep.java:80)
[05:43:04][Gradle failure report] at org.gradle.internal.execution.steps.CaptureStateAfterExecutionStep.execute(CaptureStateAfterExecutionStep.java:58)
[05:43:04][Gradle failure report] at org.gradle.internal.execution.steps.ResolveInputChangesStep.execute(ResolveInputChangesStep.java:48)
[05:43:04][Gradle failure report] at org.gradle.internal.execution.steps.ResolveInputChangesStep.execute(ResolveInputChangesStep.java:36)
[05:43:04][Gradle failure report] at org.gradle.internal.execution.steps.BuildCacheStep.executeWithoutCache(BuildCacheStep.java:181)
[05:43:04][Gradle failure report] at org.gradle.internal.execution.steps.BuildCacheStep.lambda$execute$1(BuildCacheStep.java:71)
[05:43:04][Gradle failure report] at org.gradle.internal.Either$Right.fold(Either.java:175)
[05:43:04][Gradle failure report] at org.gradle.internal.execution.caching.CachingState.fold(CachingState.java:59)
[05:43:04][Gradle failure report] at org.gradle.internal.execution.steps.BuildCacheStep.execute(BuildCacheStep.java:69)
[05:43:04][Gradle failure report] at org.gradle.internal.execution.steps.BuildCacheStep.execute(BuildCacheStep.java:47)
[05:43:04][Gradle failure report] at org.gradle.internal.execution.steps.StoreExecutionStateStep.execute(StoreExecutionStateStep.java:36)
[05:43:04][Gradle failure report] at org.gradle.internal.execution.steps.StoreExecutionStateStep.execute(StoreExecutionStateStep.java:25)
[05:43:04][Gradle failure report] at org.gradle.internal.execution.steps.RecordOutputsStep.execute(RecordOutputsStep.java:36)
[05:43:04][Gradle failure report] at org.gradle.internal.execution.steps.RecordOutputsStep.execute(RecordOutputsStep.java:22)
[05:43:04][Gradle failure report] at org.gradle.internal.execution.steps.SkipUpToDateStep.executeBecause(SkipUpToDateStep.java:110)
[05:43:04][Gradle failure report] at org.gradle.internal.execution.steps.SkipUpToDateStep.lambda$execute$2(SkipUpToDateStep.java:56)
[05:43:04][Gradle failure report] at org.gradle.internal.execution.steps.SkipUpToDateStep.execute(SkipUpToDateStep.java:56)
[05:43:04][Gradle failure report] at org.gradle.internal.execution.steps.SkipUpToDateStep.execute(SkipUpToDateStep.java:38)
[05:43:04][Gradle failure report] at org.gradle.internal.execution.steps.ResolveChangesStep.execute(ResolveChangesStep.java:73)
[05:43:04][Gradle failure report] at org.gradle.internal.execution.steps.ResolveChangesStep.execute(ResolveChangesStep.java:44)
[05:43:04][Gradle failure report] at org.gradle.internal.execution.steps.legacy.MarkSnapshottingInputsFinishedStep.execute(MarkSnapshottingInputsFinishedStep.java:37)
[05:43:04][Gradle failure report] at org.gradle.internal.execution.steps.legacy.MarkSnapshottingInputsFinishedStep.execute(MarkSnapshottingInputsFinishedStep.java:27)
[05:43:04][Gradle failure report] at org.gradle.internal.execution.steps.ResolveCachingStateStep.execute(ResolveCachingStateStep.java:89)
[05:43:04][Gradle failure report] at org.gradle.internal.execution.steps.ResolveCachingStateStep.execute(ResolveCachingStateStep.java:50)
[05:43:04][Gradle failure report] at org.gradle.internal.execution.steps.ValidateStep.execute(ValidateStep.java:114)
[05:43:04][Gradle failure report] at org.gradle.internal.execution.steps.ValidateStep.execute(ValidateStep.java:57)
[05:43:04][Gradle failure report] at org.gradle.internal.execution.steps.CaptureStateBeforeExecutionStep.execute(CaptureStateBeforeExecutionStep.java:76)
[05:43:04][Gradle failure report] at org.gradle.internal.execution.steps.CaptureStateBeforeExecutionStep.execute(CaptureStateBeforeExecutionStep.java:50)
[05:43:04][Gradle failure report] at org.gradle.internal.execution.steps.SkipEmptyWorkStep.executeWithNoEmptySources(SkipEmptyWorkStep.java:254)
[05:43:04][Gradle failure report] at org.gradle.internal.execution.steps.SkipEmptyWorkStep.executeWithNoEmptySources(SkipEmptyWorkStep.java:209)
[05:43:04][Gradle failure report] at org.gradle.internal.execution.steps.SkipEmptyWorkStep.execute(SkipEmptyWorkStep.java:88)
[05:43:04][Gradle failure report] at org.gradle.internal.execution.steps.SkipEmptyWorkStep.execute(SkipEmptyWorkStep.java:56)
[05:43:04][Gradle failure report] at org.gradle.internal.execution.steps.RemoveUntrackedExecutionStateStep.execute(RemoveUntrackedExecutionStateStep.java:32)
[05:43:04][Gradle failure report] at org.gradle.internal.execution.steps.RemoveUntrackedExecutionStateStep.execute(RemoveUntrackedExecutionStateStep.java:21)
[05:43:04][Gradle failure report] at org.gradle.internal.execution.steps.legacy.MarkSnapshottingInputsStartedStep.execute(MarkSnapshottingInputsStartedStep.java:38)
[05:43:04][Gradle failure report] at org.gradle.internal.execution.steps.LoadPreviousExecutionStateStep.execute(LoadPreviousExecutionStateStep.java:43)
[05:43:04][Gradle failure report] at org.gradle.internal.execution.steps.LoadPreviousExecutionStateStep.execute(LoadPreviousExecutionStateStep.java:31)
[05:43:04][Gradle failure report] at org.gradle.internal.execution.steps.AssignWorkspaceStep.lambda$execute$0(AssignWorkspaceStep.java:40)
[05:43:04][Gradle failure report] at org.gradle.api.internal.tasks.execution.TaskExecution$4.withWorkspace(TaskExecution.java:281)
[05:43:04][Gradle failure report] at org.gradle.internal.execution.steps.AssignWorkspaceStep.execute(AssignWorkspaceStep.java:40)
[05:43:04][Gradle failure report] at org.gradle.internal.execution.steps.AssignWorkspaceStep.execute(AssignWorkspaceStep.java:30)
[05:43:04][Gradle failure report] at org.gradle.internal.execution.steps.IdentityCacheStep.execute(IdentityCacheStep.java:37)
[05:43:04][Gradle failure report] at org.gradle.internal.execution.steps.IdentityCacheStep.execute(IdentityCacheStep.java:27)
[05:43:04][Gradle failure report] at org.gradle.internal.execution.steps.IdentifyStep.execute(IdentifyStep.java:44)
[05:43:04][Gradle failure report] at org.gradle.internal.execution.steps.IdentifyStep.execute(IdentifyStep.java:33)
[05:43:04][Gradle failure report] at org.gradle.internal.execution.impl.DefaultExecutionEngine$1.execute(DefaultExecutionEngine.java:76)
[05:43:04][Gradle failure report] at org.gradle.api.internal.tasks.execution.ExecuteActionsTaskExecuter.executeIfValid(ExecuteActionsTaskExecuter.java:139)
[05:43:04][Gradle failure report] at org.gradle.api.internal.tasks.execution.ExecuteActionsTaskExecuter.execute(ExecuteActionsTaskExecuter.java:128)
[05:43:04][Gradle failure report] at org.gradle.api.internal.tasks.execution.CleanupStaleOutputsExecuter.execute(CleanupStaleOutputsExecuter.java:77)
[05:43:04][Gradle failure report] at org.gradle.api.internal.tasks.execution.FinalizePropertiesTaskExecuter.execute(FinalizePropertiesTaskExecuter.java:46)
[05:43:04][Gradle failure report] at org.gradle.api.internal.tasks.execution.ResolveTaskExecutionModeExecuter.execute(ResolveTaskExecutionModeExecuter.java:51)
[05:43:04][Gradle failure report] at org.gradle.api.internal.tasks.execution.SkipTaskWithNoActionsExecuter.execute(SkipTaskWithNoActionsExecuter.java:57)
[05:43:04][Gradle failure report] at org.gradle.api.internal.tasks.execution.SkipOnlyIfTaskExecuter.execute(SkipOnlyIfTaskExecuter.java:56)
[05:43:04][Gradle failure report] at org.gradle.api.internal.tasks.execution.CatchExceptionTaskExecuter.execute(CatchExceptionTaskExecuter.java:36)
[05:43:04][Gradle failure report] at org.gradle.api.internal.tasks.execution.EventFiringTaskExecuter$1.executeTask(EventFiringTaskExecuter.java:77)
[05:43:04][Gradle failure report] at org.gradle.api.internal.tasks.execution.EventFiringTaskExecuter$1.call(EventFiringTaskExecuter.java:55)
[05:43:04][Gradle failure report] at org.gradle.api.internal.tasks.execution.EventFiringTaskExecuter$1.call(EventFiringTaskExecuter.java:52)
[05:43:04][Gradle failure report] at org.gradle.internal.operations.DefaultBuildOperationRunner$CallableBuildOperationWorker.execute(DefaultBuildOperationRunner.java:204)
[05:43:04][Gradle failure report] at org.gradle.internal.operations.DefaultBuildOperationRunner$CallableBuildOperationWorker.execute(DefaultBuildOperationRunner.java:199)
[05:43:04][Gradle failure report] at org.gradle.internal.operations.DefaultBuildOperationRunner$2.execute(DefaultBuildOperationRunner.java:66)
[05:43:04][Gradle failure report] at org.gradle.internal.operations.DefaultBuildOperationRunner$2.execute(DefaultBuildOperationRunner.java:59)
[05:43:04][Gradle failure report] at org.gradle.internal.operations.DefaultBuildOperationRunner.execute(DefaultBuildOperationRunner.java:157)
[05:43:04][Gradle failure report] at org.gradle.internal.operations.DefaultBuildOperationRunner.execute(DefaultBuildOperationRunner.java:59)
[05:43:04][Gradle failure report] at org.gradle.internal.operations.DefaultBuildOperationRunner.call(DefaultBuildOperationRunner.java:53)
[05:43:04][Gradle failure report] at org.gradle.internal.operations.DefaultBuildOperationExecutor.call(DefaultBuildOperationExecutor.java:73)
[05:43:04][Gradle failure report] at org.gradle.api.internal.tasks.execution.EventFiringTaskExecuter.execute(EventFiringTaskExecuter.java:52)
[05:43:04][Gradle failure report] at org.gradle.execution.plan.LocalTaskNodeExecutor.execute(LocalTaskNodeExecutor.java:69)
[05:43:04][Gradle failure report] at org.gradle.execution.taskgraph.DefaultTaskExecutionGraph$InvokeNodeExecutorsAction.execute(DefaultTaskExecutionGraph.java:327)
[05:43:04][Gradle failure report] at org.gradle.execution.taskgraph.DefaultTaskExecutionGraph$InvokeNodeExecutorsAction.execute(DefaultTaskExecutionGraph.java:314)
[05:43:04][Gradle failure report] at org.gradle.execution.taskgraph.DefaultTaskExecutionGraph$BuildOperationAwareExecutionAction.execute(DefaultTaskExecutionGraph.java:307)
[05:43:04][Gradle failure report] at org.gradle.execution.taskgraph.DefaultTaskExecutionGraph$BuildOperationAwareExecutionAction.execute(DefaultTaskExecutionGraph.java:293)
[05:43:04][Gradle failure report] at org.gradle.execution.plan.DefaultPlanExecutor$ExecutorWorker.execute(DefaultPlanExecutor.java:420)
[05:43:04][Gradle failure report] at org.gradle.execution.plan.DefaultPlanExecutor$ExecutorWorker.run(DefaultPlanExecutor.java:342)
[05:43:04][Gradle failure report] at org.gradle.internal.concurrent.ExecutorPolicy$CatchAndRecordFailures.onExecute(ExecutorPolicy.java:64)
[05:43:04][Gradle failure report] at org.gradle.internal.concurrent.ManagedExecutorImpl$1.run(ManagedExecutorImpl.java:48)
[05:43:04][Gradle failure report]
[05:43:04][Gradle failure report] ==============================================================================
[05:43:04][Gradle failure report]
[05:43:04][Gradle failure report] 2: Task failed with an exception.
[05:43:04][Gradle failure report] -----------
[05:43:04][Gradle failure report] * What went wrong:
[05:43:04][Gradle failure report] java.lang.StackOverflowError (no error message)
[05:43:04][Gradle failure report]
[05:43:04][Gradle failure report] * Try:
[05:43:04][Gradle failure report] > Run with --info or --debug option to get more log output.
[05:43:04][Gradle failure report] > Run with --scan to get full insights.
[05:43:04][Gradle failure report]
[05:43:04][Gradle failure report] * Exception is:
[05:43:04][Gradle failure report] java.lang.StackOverflowError
[05:43:04][Gradle failure report] at org.gradle.execution.plan.FinalizerGroup.isCanCancel(FinalizerGroup.java:153)
[05:43:04][Gradle failure report] at org.gradle.execution.plan.CompositeNodeGroup.isCanCancel(CompositeNodeGroup.java:101)
[05:43:04][Gradle failure report] at org.gradle.execution.plan.Node.isCanCancel(Node.java:232)
[05:43:04][Gradle failure report] at org.gradle.execution.plan.FinalizerGroup.isCanCancel(FinalizerGroup.java:155)
[05:43:04][Gradle failure report] at org.gradle.execution.plan.CompositeNodeGroup.isCanCancel(CompositeNodeGroup.java:101)
[05:43:04][Gradle failure report] at org.gradle.execution.plan.Node.isCanCancel(Node.java:232)
[05:43:04][Gradle failure report] at org.gradle.execution.plan.FinalizerGroup.isCanCancel(FinalizerGroup.java:155)
[05:43:04][Gradle failure report] at org.gradle.execution.plan.CompositeNodeGroup.isCanCancel(CompositeNodeGroup.java:101)
[05:43:04][Gradle failure report] at org.gradle.execution.plan.Node.isCanCancel(Node.java:232)
[05:43:04][Gradle failure report] at org.gradle.execution.plan.FinalizerGroup.isCanCancel(FinalizerGroup.java:155)
[05:43:04][Gradle failure report] at org.gradle.execution.plan.CompositeNodeGroup.isCanCancel(CompositeNodeGroup.java:101)
[05:43:04][Gradle failure report] at org.gradle.execution.plan.Node.isCanCancel(Node.java:232)
[05:43:04][Gradle failure report] at org.gradle.execution.plan.FinalizerGroup.isCanCancel(FinalizerGroup.java:155)
[05:43:04][Gradle failure report] at org.gradle.execution.plan.CompositeNodeGroup.isCanCancel(CompositeNodeGroup.java:101)
[05:43:04][Gradle failure report] at org.gradle.execution.plan.Node.isCanCancel(Node.java:232)
[05:43:04][Gradle failure report] at org.gradle.execution.plan.FinalizerGroup.isCanCancel(FinalizerGroup.java:155)
[05:43:04][Gradle failure report] at org.gradle.execution.plan.CompositeNodeGroup.isCanCancel(CompositeNodeGroup.java:101)
[05:43:04][Gradle failure report] at org.gradle.execution.plan.Node.isCanCancel(Node.java:232)
[05:43:04][Gradle failure report] at org.gradle.execution.plan.FinalizerGroup.isCanCancel(FinalizerGroup.java:155)
[05:43:04][Gradle failure report] at org.gradle.execution.plan.CompositeNodeGroup.isCanCancel(CompositeNodeGroup.java:101)
[05:43:04][Gradle failure report] at org.gradle.execution.plan.Node.isCanCancel(Node.java:232)
[05:43:04][Gradle failure report] at org.gradle.execution.plan.FinalizerGroup.isCanCancel(FinalizerGroup.java:155)
[05:43:04][Gradle failure report] at org.gradle.execution.plan.CompositeNodeGroup.isCanCancel(CompositeNodeGroup.java:101)
[05:43:04][Gradle failure report] at org.gradle.execution.plan.Node.isCanCancel(Node.java:232)
[05:43:04][Gradle failure report] at org.gradle.execution.plan.FinalizerGroup.isCanCancel(FinalizerGroup.java:155)
[05:43:04][Gradle failure report] at org.gradle.execution.plan.CompositeNodeGroup.isCanCancel(CompositeNodeGroup.java:101)
[05:43:04][Gradle failure report] at org.gradle.execution.plan.Node.isCanCancel(Node.java:232)
[05:43:04][Gradle failure report] at org.gradle.execution.plan.FinalizerGroup.isCanCancel(FinalizerGroup.java:155)
[05:43:04][Gradle failure report] at org.gradle.execution.plan.CompositeNodeGroup.isCanCancel(CompositeNodeGroup.java:101)
[05:43:04][Gradle failure report] at org.gradle.execution.plan.Node.isCanCancel(Node.java:232)
[05:43:04][Gradle failure report] at org.gradle.execution.plan.FinalizerGroup.isCanCancel(FinalizerGroup.java:155)
[05:43:04][Gradle failure report] at org.gradle.execution.plan.CompositeNodeGroup.isCanCancel(CompositeNodeGroup.java:101)
[05:43:04][Gradle failure report] at org.gradle.execution.plan.Node.isCanCancel(Node.java:232)
[05:43:04][Gradle failure report] at org.gradle.execution.plan.FinalizerGroup.isCanCancel(FinalizerGroup.java:155)
[05:43:04][Gradle failure report] at org.gradle.execution.plan.CompositeNodeGroup.isCanCancel(CompositeNodeGroup.java:101)
[05:43:04][Gradle failure report] at org.gradle.execution.plan.Node.isCanCancel(Node.java:232)
[05:43:04][Gradle failure report] at org.gradle.execution.plan.FinalizerGroup.isCanCancel(FinalizerGroup.java:155)
[05:43:04][Gradle failure report] at org.gradle.execution.plan.CompositeNodeGroup.isCanCancel(CompositeNodeGroup.java:101)
[05:43:04][Gradle failure report] at org.gradle.execution.plan.Node.isCanCancel(Node.java:232)
[05:43:04][Gradle failure report] at org.gradle.execution.plan.FinalizerGroup.isCanCancel(FinalizerGroup.java:155)
[05:43:04][Gradle failure report] at org.gradle.execution.plan.CompositeNodeGroup.isCanCancel(CompositeNodeGroup.java:101)
[05:43:04][Gradle failure report] at org.gradle.execution.plan.Node.isCanCancel(Node.java:232)
[05:43:04][Gradle failure report] at org.gradle.execution.plan.FinalizerGroup.isCanCancel(FinalizerGroup.java:155)
[05:43:04][Gradle failure report] at org.gradle.execution.plan.CompositeNodeGroup.isCanCancel(CompositeNodeGroup.java:101)
[05:43:04][Gradle failure report] at org.gradle.execution.plan.Node.isCanCancel(Node.java:232)
[05:43:04][Gradle failure report] at org.gradle.execution.plan.FinalizerGroup.isCanCancel(FinalizerGroup.java:155)
[05:43:04][Gradle failure report] at org.gradle.execution.plan.CompositeNodeGroup.isCanCancel(CompositeNodeGroup.java:101)
[05:43:04][Gradle failure report] at org.gradle.execution.plan.Node.isCanCancel(Node.java:232)
[05:43:04][Gradle failure report] at org.gradle.execution.plan.FinalizerGroup.isCanCancel(FinalizerGroup.java:155)
[05:43:04][Gradle failure report] at org.gradle.execution.plan.CompositeNodeGroup.isCanCancel(CompositeNodeGroup.java:101)
[05:43:04][Gradle failure report] at org.gradle.execution.plan.Node.isCanCancel(Node.java:232)
[05:43:04][Gradle failure report] at org.gradle.execution.plan.FinalizerGroup.isCanCancel(FinalizerGroup.java:155)
[05:43:04][Gradle failure report] at org.gradle.execution.plan.CompositeNodeGroup.isCanCancel(CompositeNodeGroup.java:101)
[05:43:04][Gradle failure report] at org.gradle.execution.plan.Node.isCanCancel(Node.java:232)
[05:43:04][Gradle failure report] at org.gradle.execution.plan.FinalizerGroup.isCanCancel(FinalizerGroup.java:155)
[05:43:04][Gradle failure report] at org.gradle.execution.plan.CompositeNodeGroup.isCanCancel(CompositeNodeGroup.java:101)
[05:43:04][Gradle failure report] at org.gradle.execution.plan.Node.isCanCancel(Node.java:232)
[05:43:04][Gradle failure report] at org.gradle.execution.plan.FinalizerGroup.isCanCancel(FinalizerGroup.java:155)
[05:43:04][Gradle failure report] at org.gradle.execution.plan.CompositeNodeGroup.isCanCancel(CompositeNodeGroup.java:101)
[05:43:04][Gradle failure report] at org.gradle.execution.plan.Node.isCanCancel(Node.java:232)
[05:43:04][Gradle failure report] at org.gradle.execution.plan.FinalizerGroup.isCanCancel(FinalizerGroup.java:155)
[05:43:04][Gradle failure report] at org.gradle.execution.plan.CompositeNodeGroup.isCanCancel(CompositeNodeGroup.java:101)
[05:43:04][Gradle failure report] at org.gradle.execution.plan.Node.isCanCancel(Node.java:232)
[05:43:04][Gradle failure report] at org.gradle.execution.plan.FinalizerGroup.isCanCancel(FinalizerGroup.java:155)
[05:43:04][Gradle failure report] at org.gradle.execution.plan.CompositeNodeGroup.isCanCancel(CompositeNodeGroup.java:101)
[05:43:04][Gradle failure report] at org.gradle.execution.plan.Node.isCanCancel(Node.java:232)
[05:43:04][Gradle failure report] at org.gradle.execution.plan.FinalizerGroup.isCanCancel(FinalizerGroup.java:155)
[05:43:04][Gradle failure report] at org.gradle.execution.plan.CompositeNodeGroup.isCanCancel(CompositeNodeGroup.java:101)
[05:43:04][Gradle failure report] at org.gradle.execution.plan.Node.isCanCancel(Node.java:232)
[05:43:04][Gradle failure report] at org.gradle.execution.plan.FinalizerGroup.isCanCancel(FinalizerGroup.java:155)
[05:43:04][Gradle failure report] at org.gradle.execution.plan.CompositeNodeGroup.isCanCancel(CompositeNodeGroup.java:101)
[05:43:04][Gradle failure report] at org.gradle.execution.plan.Node.isCanCancel(Node.java:232)
[05:43:04][Gradle failure report] at org.gradle.execution.plan.FinalizerGroup.isCanCancel(FinalizerGroup.java:155)
[05:43:04][Gradle failure report] at org.gradle.execution.plan.CompositeNodeGroup.isCanCancel(CompositeNodeGroup.java:101)
[05:43:04][Gradle failure report] at org.gradle.execution.plan.Node.isCanCancel(Node.java:232)
[05:43:04][Gradle failure report] at org.gradle.execution.plan.FinalizerGroup.isCanCancel(FinalizerGroup.java:155)
[05:43:04][Gradle failure report] at org.gradle.execution.plan.CompositeNodeGroup.isCanCancel(CompositeNodeGroup.java:101)
[05:43:04][Gradle failure report] at org.gradle.execution.plan.Node.isCanCancel(Node.java:232)
[05:43:04][Gradle failure report] at org.gradle.execution.plan.FinalizerGroup.isCanCancel(FinalizerGroup.java:155)
[05:43:04][Gradle failure report] at org.gradle.execution.plan.CompositeNodeGroup.isCanCancel(CompositeNodeGroup.java:101)
[05:43:04][Gradle failure report] at org.gradle.execution.plan.Node.isCanCancel(Node.java:232)
[05:43:04][Gradle failure report] at org.gradle.execution.plan.FinalizerGroup.isCanCancel(FinalizerGroup.java:155)
[05:43:04][Gradle failure report] at org.gradle.execution.plan.CompositeNodeGroup.isCanCancel(CompositeNodeGroup.java:101)
[05:43:04][Gradle failure report] at org.gradle.execution.plan.Node.isCanCancel(Node.java:232)
[05:43:04][Gradle failure report] at org.gradle.execution.plan.FinalizerGroup.isCanCancel(FinalizerGroup.java:155)
[05:43:04][Gradle failure report] at org.gradle.execution.plan.CompositeNodeGroup.isCanCancel(CompositeNodeGroup.java:101)
[05:43:04][Gradle failure report] at org.gradle.execution.plan.Node.isCanCancel(Node.java:232)
[05:43:04][Gradle failure report] at org.gradle.execution.plan.FinalizerGroup.isCanCancel(FinalizerGroup.java:155)
[05:43:04][Gradle failure report] at org.gradle.execution.plan.CompositeNodeGroup.isCanCancel(CompositeNodeGroup.java:101)
[05:43:04][Gradle failure report] at org.gradle.execution.plan.Node.isCanCancel(Node.java:232)
[05:43:04][Gradle failure report] at org.gradle.execution.plan.FinalizerGroup.isCanCancel(FinalizerGroup.java:155)
[05:43:04][Gradle failure report] at org.gradle.execution.plan.CompositeNodeGroup.isCanCancel(CompositeNodeGroup.java:101)
[05:43:04][Gradle failure report] at org.gradle.execution.plan.Node.isCanCancel(Node.java:232)
[05:43:04][Gradle failure report] at org.gradle.execution.plan.FinalizerGroup.isCanCancel(FinalizerGroup.java:155)
[05:43:04][Gradle failure report] at org.gradle.execution.plan.CompositeNodeGroup.isCanCancel(CompositeNodeGroup.java:101)
[05:43:04][Gradle failure report] at org.gradle.execution.plan.Node.isCanCancel(Node.java:232)
[05:43:04][Gradle failure report] at org.gradle.execution.plan.FinalizerGroup.isCanCancel(FinalizerGroup.java:155)
[05:43:04][Gradle failure report] at org.gradle.execution.plan.CompositeNodeGroup.isCanCancel(CompositeNodeGroup.java:101)
[05:43:04][Gradle failure report] at org.gradle.execution.plan.Node.isCanCancel(Node.java:232)
[05:43:04][Gradle failure report] at org.gradle.execution.plan.FinalizerGroup.isCanCancel(FinalizerGroup.java:155)
[05:43:04][Gradle failure report] at org.gradle.execution.plan.CompositeNodeGroup.isCanCancel(CompositeNodeGroup.java:101)
[05:43:04][Gradle failure report] at org.gradle.execution.plan.Node.isCanCancel(Node.java:232)
[05:43:04][Gradle failure report] at org.gradle.execution.plan.FinalizerGroup.isCanCancel(FinalizerGroup.java:155)
[05:43:04][Gradle failure report] at org.gradle.execution.plan.CompositeNodeGroup.isCanCancel(CompositeNodeGroup.java:101)
[05:43:04][Gradle failure report] at org.gradle.execution.plan.Node.isCanCancel(Node.java:232)
[05:43:04][Gradle failure report] at org.gradle.execution.plan.FinalizerGroup.isCanCancel(FinalizerGroup.java:155)
[05:43:04][Gradle failure report] at org.gradle.execution.plan.CompositeNodeGroup.isCanCancel(CompositeNodeGroup.java:101)
[05:43:04][Gradle failure report] at org.gradle.execution.plan.Node.isCanCancel(Node.java:232)
[05:43:04][Gradle failure report] at org.gradle.execution.plan.FinalizerGroup.isCanCancel(FinalizerGroup.java:155)
[05:43:04][Gradle failure report] at org.gradle.execution.plan.CompositeNodeGroup.isCanCancel(CompositeNodeGroup.java:101)
[05:43:04][Gradle failure report] at org.gradle.execution.plan.Node.isCanCancel(Node.java:232)
[05:43:04][Gradle failure report] at org.gradle.execution.plan.FinalizerGroup.isCanCancel(FinalizerGroup.java:155)
[05:43:04][Gradle failure report] at org.gradle.execution.plan.CompositeNodeGroup.isCanCancel(CompositeNodeGroup.java:101)
[05:43:04][Gradle failure report] at org.gradle.execution.plan.Node.isCanCancel(Node.java:232)
[05:43:04][Gradle failure report] at org.gradle.execution.plan.FinalizerGroup.isCanCancel(FinalizerGroup.java:155)
[05:43:04][Gradle failure report] at org.gradle.execution.plan.CompositeNodeGroup.isCanCancel(CompositeNodeGroup.java:101)
[05:43:04][Gradle failure report] at org.gradle.execution.plan.Node.isCanCancel(Node.java:232)
[05:43:04][Gradle failure report] at org.gradle.execution.plan.FinalizerGroup.isCanCancel(FinalizerGroup.java:155)
[05:43:04][Gradle failure report] at org.gradle.execution.plan.CompositeNodeGroup.isCanCancel(CompositeNodeGroup.java:101)
[05:43:04][Gradle failure report] at org.gradle.execution.plan.Node.isCanCancel(Node.java:232)
[05:43:04][Gradle failure report] at org.gradle.execution.plan.FinalizerGroup.isCanCancel(FinalizerGroup.java:155)
[05:43:04][Gradle failure report] at org.gradle.execution.plan.CompositeNodeGroup.isCanCancel(CompositeNodeGroup.java:101)
[05:43:04][Gradle failure report] at org.gradle.execution.plan.Node.isCanCancel(Node.java:232)
[05:43:04][Gradle failure report] at org.gradle.execution.plan.FinalizerGroup.isCanCancel(FinalizerGroup.java:155)
[05:43:04][Gradle failure report] at org.gradle.execution.plan.CompositeNodeGroup.isCanCancel(CompositeNodeGroup.java:101)
[05:43:04][Gradle failure report] at org.gradle.execution.plan.Node.isCanCancel(Node.java:232)
[05:43:04][Gradle failure report] at org.gradle.execution.plan.FinalizerGroup.isCanCancel(FinalizerGroup.java:155)
[05:43:04][Gradle failure report] at org.gradle.execution.plan.CompositeNodeGroup.isCanCancel(CompositeNodeGroup.java:101)
[05:43:04][Gradle failure report] at org.gradle.execution.plan.Node.isCanCancel(Node.java:232)
[05:43:04][Gradle failure report] at org.gradle.execution.plan.FinalizerGroup.isCanCancel(FinalizerGroup.java:155)
[05:43:04][Gradle failure report] at org.gradle.execution.plan.CompositeNodeGroup.isCanCancel(CompositeNodeGroup.java:101)
[05:43:04][Gradle failure report] at org.gradle.execution.plan.Node.isCanCancel(Node.java:232)
[05:43:04][Gradle failure report] at org.gradle.execution.plan.FinalizerGroup.isCanCancel(FinalizerGroup.java:155)
[05:43:04][Gradle failure report] at org.gradle.execution.plan.CompositeNodeGroup.isCanCancel(CompositeNodeGroup.java:101)
[05:43:04][Gradle failure report] at org.gradle.execution.plan.Node.isCanCancel(Node.java:232)
[05:43:04][Gradle failure report] at org.gradle.execution.plan.FinalizerGroup.isCanCancel(FinalizerGroup.java:155)
[05:43:04][Gradle failure report] at org.gradle.execution.plan.CompositeNodeGroup.isCanCancel(CompositeNodeGroup.java:101)
[05:43:04][Gradle failure report] at org.gradle.execution.plan.Node.isCanCancel(Node.java:232)
[05:43:04][Gradle failure report] at org.gradle.execution.plan.FinalizerGroup.isCanCancel(FinalizerGroup.java:155)
[05:43:04][Gradle failure report] at org.gradle.execution.plan.CompositeNodeGroup.isCanCancel(CompositeNodeGroup.java:101)
[05:43:04][Gradle failure report] at org.gradle.execution.plan.Node.isCanCancel(Node.java:232)
[05:43:04][Gradle failure report] at org.gradle.execution.plan.FinalizerGroup.isCanCancel(FinalizerGroup.java:155)
[05:43:04][Gradle failure report] at org.gradle.execution.plan.CompositeNodeGroup.isCanCancel(CompositeNodeGroup.java:101)
[05:43:04][Gradle failure report] at org.gradle.execution.plan.Node.isCanCancel(Node.java:232)
[05:43:04][Gradle failure report] at org.gradle.execution.plan.FinalizerGroup.isCanCancel(FinalizerGroup.java:155)
[05:43:04][Gradle failure report] at org.gradle.execution.plan.CompositeNodeGroup.isCanCancel(CompositeNodeGroup.java:101)
[05:43:04][Gradle failure report] at org.gradle.execution.plan.Node.isCanCancel(Node.java:232)
[05:43:04][Gradle failure report] at org.gradle.execution.plan.FinalizerGroup.isCanCancel(FinalizerGroup.java:155)
[05:43:04][Gradle failure report] at org.gradle.execution.plan.CompositeNodeGroup.isCanCancel(CompositeNodeGroup.java:101)
[05:43:04][Gradle failure report] at org.gradle.execution.plan.Node.isCanCancel(Node.java:232)
[05:43:04][Gradle failure report] at org.gradle.execution.plan.FinalizerGroup.isCanCancel(FinalizerGroup.java:155)
[05:43:04][Gradle failure report] at org.gradle.execution.plan.CompositeNodeGroup.isCanCancel(CompositeNodeGroup.java:101)
[05:43:04][Gradle failure report] at org.gradle.execution.plan.Node.isCanCancel(Node.java:232)
[05:43:04][Gradle failure report] at org.gradle.execution.plan.FinalizerGroup.isCanCancel(FinalizerGroup.java:155)
[05:43:04][Gradle failure report] at org.gradle.execution.plan.CompositeNodeGroup.isCanCancel(CompositeNodeGroup.java:101)
[05:43:04][Gradle failure report] at org.gradle.execution.plan.Node.isCanCancel(Node.java:232)
[05:43:04][Gradle failure report] at org.gradle.execution.plan.FinalizerGroup.isCanCancel(FinalizerGroup.java:155)
[05:43:04][Gradle failure report] at org.gradle.execution.plan.CompositeNodeGroup.isCanCancel(CompositeNodeGroup.java:101)
[05:43:04][Gradle failure report] at org.gradle.execution.plan.Node.isCanCancel(Node.java:232)
[05:43:04][Gradle failure report] at org.gradle.execution.plan.FinalizerGroup.isCanCancel(FinalizerGroup.java:155)
[05:43:04][Gradle failure report] at org.gradle.execution.plan.CompositeNodeGroup.isCanCancel(CompositeNodeGroup.java:101)
[05:43:04][Gradle failure report] at org.gradle.execution.plan.Node.isCanCancel(Node.java:232)
[05:43:04][Gradle failure report] at org.gradle.execution.plan.FinalizerGroup.isCanCancel(FinalizerGroup.java:155)
[05:43:04][Gradle failure report] at org.gradle.execution.plan.CompositeNodeGroup.isCanCancel(CompositeNodeGroup.java:101)
[05:43:04][Gradle failure report] at org.gradle.execution.plan.Node.isCanCancel(Node.java:232)
[05:43:04][Gradle failure report] at org.gradle.execution.plan.FinalizerGroup.isCanCancel(FinalizerGroup.java:155)
[05:43:04][Gradle failure report] at org.gradle.execution.plan.CompositeNodeGroup.isCanCancel(CompositeNodeGroup.java:101)
[05:43:04][Gradle failure report] at org.gradle.execution.plan.Node.isCanCancel(Node.java:232)
[05:43:04][Gradle failure report] at org.gradle.execution.plan.FinalizerGroup.isCanCancel(FinalizerGroup.java:155)
[05:43:04][Gradle failure report] at org.gradle.execution.plan.CompositeNodeGroup.isCanCancel(CompositeNodeGroup.java:101)
[05:43:04][Gradle failure report] at org.gradle.execution.plan.Node.isCanCancel(Node.java:232)
[05:43:04][Gradle failure report] at org.gradle.execution.plan.FinalizerGroup.isCanCancel(FinalizerGroup.java:155)
[05:43:04][Gradle failure report] at org.gradle.execution.plan.CompositeNodeGroup.isCanCancel(CompositeNodeGroup.java:101)
[05:43:04][Gradle failure report] at org.gradle.execution.plan.Node.isCanCancel(Node.java:232)
[05:43:04][Gradle failure report] at org.gradle.execution.plan.FinalizerGroup.isCanCancel(FinalizerGroup.java:155)
[05:43:04][Gradle failure report] at org.gradle.execution.plan.CompositeNodeGroup.isCanCancel(CompositeNodeGroup.java:101)
[05:43:04][Gradle failure report] at org.gradle.execution.plan.Node.isCanCancel(Node.java:232)
[05:43:04][Gradle failure report] at org.gradle.execution.plan.FinalizerGroup.isCanCancel(FinalizerGroup.java:155)
[05:43:04][Gradle failure report] at org.gradle.execution.plan.CompositeNodeGroup.isCanCancel(CompositeNodeGroup.java:101)
[05:43:04][Gradle failure report] at org.gradle.execution.plan.Node.isCanCancel(Node.java:232)
[05:43:04][Gradle failure report] at org.gradle.execution.plan.FinalizerGroup.isCanCancel(FinalizerGroup.java:155)
[05:43:04][Gradle failure report] at org.gradle.execution.plan.CompositeNodeGroup.isCanCancel(CompositeNodeGroup.java:101)
[05:43:04][Gradle failure report] at org.gradle.execution.plan.Node.isCanCancel(Node.java:232)
[05:43:04][Gradle failure report] at org.gradle.execution.plan.FinalizerGroup.isCanCancel(FinalizerGroup.java:155)
[05:43:04][Gradle failure report] at org.gradle.execution.plan.CompositeNodeGroup.isCanCancel(CompositeNodeGroup.java:101)
[05:43:04][Gradle failure report] at org.gradle.execution.plan.Node.isCanCancel(Node.java:232)
[05:43:04][Gradle failure report] at org.gradle.execution.plan.FinalizerGroup.isCanCancel(FinalizerGroup.java:155)
[05:43:04][Gradle failure report] at org.gradle.execution.plan.CompositeNodeGroup.isCanCancel(CompositeNodeGroup.java:101)
[05:43:04][Gradle failure report] at org.gradle.execution.plan.Node.isCanCancel(Node.java:232)
[05:43:04][Gradle failure report] at org.gradle.execution.plan.FinalizerGroup.isCanCancel(FinalizerGroup.java:155)
[05:43:04][Gradle failure report] at org.gradle.execution.plan.CompositeNodeGroup.isCanCancel(CompositeNodeGroup.java:101)
[05:43:04][Gradle failure report] at org.gradle.execution.plan.Node.isCanCancel(Node.java:232)
[05:43:04][Gradle failure report] at org.gradle.execution.plan.FinalizerGroup.isCanCancel(FinalizerGroup.java:155)
[05:43:04][Gradle failure report] at org.gradle.execution.plan.CompositeNodeGroup.isCanCancel(CompositeNodeGroup.java:101)
[05:43:04][Gradle failure report] at org.gradle.execution.plan.Node.isCanCancel(Node.java:232)
[05:43:04][Gradle failure report] at org.gradle.execution.plan.FinalizerGroup.isCanCancel(FinalizerGroup.java:155)
[05:43:04][Gradle failure report] at org.gradle.execution.plan.CompositeNodeGroup.isCanCancel(CompositeNodeGroup.java:101)
[05:43:04][Gradle failure report] at org.gradle.execution.plan.Node.isCanCancel(Node.java:232)
[05:43:04][Gradle failure report] at org.gradle.execution.plan.FinalizerGroup.isCanCancel(FinalizerGroup.java:155)
[05:43:04][Gradle failure report] at org.gradle.execution.plan.CompositeNodeGroup.isCanCancel(CompositeNodeGroup.java:101)
[05:43:04][Gradle failure report] at org.gradle.execution.plan.Node.isCanCancel(Node.java:232)
[05:43:04][Gradle failure report] at org.gradle.execution.plan.FinalizerGroup.isCanCancel(FinalizerGroup.java:155)
[05:43:04][Gradle failure report] at org.gradle.execution.plan.CompositeNodeGroup.isCanCancel(CompositeNodeGroup.java:101)
[05:43:04][Gradle failure report] at org.gradle.execution.plan.Node.isCanCancel(Node.java:232)
[05:43:04][Gradle failure report] at org.gradle.execution.plan.FinalizerGroup.isCanCancel(FinalizerGroup.java:155)
[05:43:04][Gradle failure report] at org.gradle.execution.plan.CompositeNodeGroup.isCanCancel(CompositeNodeGroup.java:101)
[05:43:04][Gradle failure report] at org.gradle.execution.plan.Node.isCanCancel(Node.java:232)
[05:43:04][Gradle failure report] at org.gradle.execution.plan.FinalizerGroup.isCanCancel(FinalizerGroup.java:155)
[05:43:04][Gradle failure report] at org.gradle.execution.plan.CompositeNodeGroup.isCanCancel(CompositeNodeGroup.java:101)
[05:43:04][Gradle failure report] at org.gradle.execution.plan.Node.isCanCancel(Node.java:232)
[05:43:04][Gradle failure report] at org.gradle.execution.plan.FinalizerGroup.isCanCancel(FinalizerGroup.java:155)
[05:43:04][Gradle failure report] at org.gradle.execution.plan.CompositeNodeGroup.isCanCancel(CompositeNodeGroup.java:101)
[05:43:04][Gradle failure report] at org.gradle.execution.plan.Node.isCanCancel(Node.java:232)
[05:43:04][Gradle failure report] at org.gradle.execution.plan.FinalizerGroup.isCanCancel(FinalizerGroup.java:155)
[05:43:04][Gradle failure report] at org.gradle.execution.plan.CompositeNodeGroup.isCanCancel(CompositeNodeGroup.java:101)
[05:43:04][Gradle failure report] at org.gradle.execution.plan.Node.isCanCancel(Node.java:232)
[05:43:04][Gradle failure report] at org.gradle.execution.plan.FinalizerGroup.isCanCancel(FinalizerGroup.java:155)
[05:43:04][Gradle failure report] at org.gradle.execution.plan.CompositeNodeGroup.isCanCancel(CompositeNodeGroup.java:101)
[05:43:04][Gradle failure report] at org.gradle.execution.plan.Node.isCanCancel(Node.java:232)
[05:43:04][Gradle failure report] at org.gradle.execution.plan.FinalizerGroup.isCanCancel(FinalizerGroup.java:155)
[05:43:04][Gradle failure report] at org.gradle.execution.plan.CompositeNodeGroup.isCanCancel(CompositeNodeGroup.java:101)
[05:43:04][Gradle failure report] at org.gradle.execution.plan.Node.isCanCancel(Node.java:232)
[05:43:04][Gradle failure report] at org.gradle.execution.plan.FinalizerGroup.isCanCancel(FinalizerGroup.java:155)
[05:43:04][Gradle failure report] at org.gradle.execution.plan.CompositeNodeGroup.isCanCancel(CompositeNodeGroup.java:101)
[05:43:04][Gradle failure report] at org.gradle.execution.plan.Node.isCanCancel(Node.java:232)
[05:43:04][Gradle failure report] at org.gradle.execution.plan.FinalizerGroup.isCanCancel(FinalizerGroup.java:155)
[05:43:04][Gradle failure report] at org.gradle.execution.plan.CompositeNodeGroup.isCanCancel(CompositeNodeGroup.java:101)
[05:43:04][Gradle failure report] at org.gradle.execution.plan.Node.isCanCancel(Node.java:232)
[05:43:04][Gradle failure report] at org.gradle.execution.plan.FinalizerGroup.isCanCancel(FinalizerGroup.java:155)
[05:43:04][Gradle failure report] at org.gradle.execution.plan.CompositeNodeGroup.isCanCancel(CompositeNodeGroup.java:101)
[05:43:04][Gradle failure report] at org.gradle.execution.plan.Node.isCanCancel(Node.java:232)
[05:43:04][Gradle failure report] at org.gradle.execution.plan.FinalizerGroup.isCanCancel(FinalizerGroup.java:155)
[05:43:04][Gradle failure report] at org.gradle.execution.plan.CompositeNodeGroup.isCanCancel(CompositeNodeGroup.java:101)
[05:43:04][Gradle failure report] at org.gradle.execution.plan.Node.isCanCancel(Node.java:232)
[05:43:04][Gradle failure report] at org.gradle.execution.plan.FinalizerGroup.isCanCancel(FinalizerGroup.java:155)
[05:43:04][Gradle failure report] at org.gradle.execution.plan.CompositeNodeGroup.isCanCancel(CompositeNodeGroup.java:101)
[05:43:04][Gradle failure report] at org.gradle.execution.plan.Node.isCanCancel(Node.java:232)
[05:43:04][Gradle failure report] at org.gradle.execution.plan.FinalizerGroup.isCanCancel(FinalizerGroup.java:155)
[05:43:04][Gradle failure report] at org.gradle.execution.plan.CompositeNodeGroup.isCanCancel(CompositeNodeGroup.java:101)
[05:43:04][Gradle failure report] at org.gradle.execution.plan.Node.isCanCancel(Node.java:232)
[05:43:04][Gradle failure report] at org.gradle.execution.plan.FinalizerGroup.isCanCancel(FinalizerGroup.java:155)
[05:43:04][Gradle failure report] at org.gradle.execution.plan.CompositeNodeGroup.isCanCancel(CompositeNodeGroup.java:101)
[05:43:04][Gradle failure report] at org.gradle.execution.plan.Node.isCanCancel(Node.java:232)
[05:43:04][Gradle failure report] at org.gradle.execution.plan.FinalizerGroup.isCanCancel(FinalizerGroup.java:155)
[05:43:04][Gradle failure report] at org.gradle.execution.plan.CompositeNodeGroup.isCanCancel(CompositeNodeGroup.java:101)
[05:43:04][Gradle failure report] at org.gradle.execution.plan.Node.isCanCancel(Node.java:232)
[05:43:04][Gradle failure report] at org.gradle.execution.plan.FinalizerGroup.isCanCancel(FinalizerGroup.java:155)
[05:43:04][Gradle failure report] at org.gradle.execution.plan.CompositeNodeGroup.isCanCancel(CompositeNodeGroup.java:101)
[05:43:04][Gradle failure report] at org.gradle.execution.plan.Node.isCanCancel(Node.java:232)
[05:43:04][Gradle failure report] at org.gradle.execution.plan.FinalizerGroup.isCanCancel(FinalizerGroup.java:155)
[05:43:04][Gradle failure report] at org.gradle.execution.plan.CompositeNodeGroup.isCanCancel(CompositeNodeGroup.java:101)
[05:43:04][Gradle failure report] at org.gradle.execution.plan.Node.isCanCancel(Node.java:232)
[05:43:04][Gradle failure report] at org.gradle.execution.plan.FinalizerGroup.isCanCancel(FinalizerGroup.java:155)
[05:43:04][Gradle failure report] at org.gradle.execution.plan.CompositeNodeGroup.isCanCancel(CompositeNodeGroup.java:101)
[05:43:04][Gradle failure report] at org.gradle.execution.plan.Node.isCanCancel(Node.java:232)
[05:43:04][Gradle failure report] at org.gradle.execution.plan.FinalizerGroup.isCanCancel(FinalizerGroup.java:155)
[05:43:04][Gradle failure report] at org.gradle.execution.plan.CompositeNodeGroup.isCanCancel(CompositeNodeGroup.java:101)
[05:43:04][Gradle failure report] at org.gradle.execution.plan.Node.isCanCancel(Node.java:232)
[05:43:04][Gradle failure report] at org.gradle.execution.plan.FinalizerGroup.isCanCancel(FinalizerGroup.java:155)
[05:43:04][Gradle failure report] at org.gradle.execution.plan.CompositeNodeGroup.isCanCancel(CompositeNodeGroup.java:101)
[05:43:04][Gradle failure report] at org.gradle.execution.plan.Node.isCanCancel(Node.java:232)
[05:43:04][Gradle failure report] at org.gradle.execution.plan.FinalizerGroup.isCanCancel(FinalizerGroup.java:155)
[05:43:04][Gradle failure report] at org.gradle.execution.plan.CompositeNodeGroup.isCanCancel(CompositeNodeGroup.java:101)
[05:43:04][Gradle failure report] at org.gradle.execution.plan.Node.isCanCancel(Node.java:232)
[05:43:04][Gradle failure report] at org.gradle.execution.plan.FinalizerGroup.isCanCancel(FinalizerGroup.java:155)
[05:43:04][Gradle failure report] at org.gradle.execution.plan.CompositeNodeGroup.isCanCancel(CompositeNodeGroup.java:101)
[05:43:04][Gradle failure report] at org.gradle.execution.plan.Node.isCanCancel(Node.java:232)
[05:43:04][Gradle failure report] at org.gradle.execution.plan.FinalizerGroup.isCanCancel(FinalizerGroup.java:155)
[05:43:04][Gradle failure report] at org.gradle.execution.plan.CompositeNodeGroup.isCanCancel(CompositeNodeGroup.java:101)
[05:43:04][Gradle failure report] at org.gradle.execution.plan.Node.isCanCancel(Node.java:232)
[05:43:04][Gradle failure report] at org.gradle.execution.plan.FinalizerGroup.isCanCancel(FinalizerGroup.java:155)
[05:43:04][Gradle failure report] at org.gradle.execution.plan.CompositeNodeGroup.isCanCancel(CompositeNodeGroup.java:101)
[05:43:04][Gradle failure report] at org.gradle.execution.plan.Node.isCanCancel(Node.java:232)
[05:43:04][Gradle failure report] at org.gradle.execution.plan.FinalizerGroup.isCanCancel(FinalizerGroup.java:155)
[05:43:04][Gradle failure report] at org.gradle.execution.plan.CompositeNodeGroup.isCanCancel(CompositeNodeGroup.java:101)
[05:43:04][Gradle failure report] at org.gradle.execution.plan.Node.isCanCancel(Node.java:232)
[05:43:04][Gradle failure report] at org.gradle.execution.plan.FinalizerGroup.isCanCancel(FinalizerGroup.java:155)
[05:43:04][Gradle failure report] at org.gradle.execution.plan.CompositeNodeGroup.isCanCancel(CompositeNodeGroup.java:101)
[05:43:04][Gradle failure report] at org.gradle.execution.plan.Node.isCanCancel(Node.java:232)
[05:43:04][Gradle failure report] at org.gradle.execution.plan.FinalizerGroup.isCanCancel(FinalizerGroup.java:155)
[05:43:04][Gradle failure report] at org.gradle.execution.plan.CompositeNodeGroup.isCanCancel(CompositeNodeGroup.java:101)
[05:43:04][Gradle failure report] at org.gradle.execution.plan.Node.isCanCancel(Node.java:232)
[05:43:04][Gradle failure report] at org.gradle.execution.plan.FinalizerGroup.isCanCancel(FinalizerGroup.java:155)
[05:43:04][Gradle failure report] at org.gradle.execution.plan.CompositeNodeGroup.isCanCancel(CompositeNodeGroup.java:101)
[05:43:04][Gradle failure report] at org.gradle.execution.plan.Node.isCanCancel(Node.java:232)
[05:43:04][Gradle failure report] at org.gradle.execution.plan.FinalizerGroup.isCanCancel(FinalizerGroup.java:155)
[05:43:04][Gradle failure report] at org.gradle.execution.plan.CompositeNodeGroup.isCanCancel(CompositeNodeGroup.java:101)
[05:43:04][Gradle failure report] at org.gradle.execution.plan.Node.isCanCancel(Node.java:232)
[05:43:04][Gradle failure report] at org.gradle.execution.plan.FinalizerGroup.isCanCancel(FinalizerGroup.java:155)
[05:43:04][Gradle failure report] at org.gradle.execution.plan.CompositeNodeGroup.isCanCancel(CompositeNodeGroup.java:101)
[05:43:04][Gradle failure report] at org.gradle.execution.plan.Node.isCanCancel(Node.java:232)
[05:43:04][Gradle failure report] at org.gradle.execution.plan.FinalizerGroup.isCanCancel(FinalizerGroup.java:155)
[05:43:04][Gradle failure report] at org.gradle.execution.plan.CompositeNodeGroup.isCanCancel(CompositeNodeGroup.java:101)
[05:43:04][Gradle failure report] at org.gradle.execution.plan.Node.isCanCancel(Node.java:232)
[05:43:04][Gradle failure report] at org.gradle.execution.plan.FinalizerGroup.isCanCancel(FinalizerGroup.java:155)
[05:43:04][Gradle failure report] at org.gradle.execution.plan.CompositeNodeGroup.isCanCancel(CompositeNodeGroup.java:101)
[05:43:04][Gradle failure report] at org.gradle.execution.plan.Node.isCanCancel(Node.java:232)
[05:43:04][Gradle failure report] at org.gradle.execution.plan.FinalizerGroup.isCanCancel(FinalizerGroup.java:155)
[05:43:04][Gradle failure report] at org.gradle.execution.plan.CompositeNodeGroup.isCanCancel(CompositeNodeGroup.java:101)
[05:43:04][Gradle failure report] at org.gradle.execution.plan.Node.isCanCancel(Node.java:232)
[05:43:04][Gradle failure report] at org.gradle.execution.plan.FinalizerGroup.isCanCancel(FinalizerGroup.java:155)
[05:43:04][Gradle failure report] at org.gradle.execution.plan.CompositeNodeGroup.isCanCancel(CompositeNodeGroup.java:101)
[05:43:04][Gradle failure report] at org.gradle.execution.plan.Node.isCanCancel(Node.java:232)
[05:43:04][Gradle failure report] at org.gradle.execution.plan.FinalizerGroup.isCanCancel(FinalizerGroup.java:155)
[05:43:04][Gradle failure report] at org.gradle.execution.plan.CompositeNodeGroup.isCanCancel(CompositeNodeGroup.java:101)
[05:43:04][Gradle failure report] at org.gradle.execution.plan.Node.isCanCancel(Node.java:232)
[05:43:04][Gradle failure report] at org.gradle.execution.plan.FinalizerGroup.isCanCancel(FinalizerGroup.java:155)
[05:43:04][Gradle failure report] at org.gradle.execution.plan.CompositeNodeGroup.isCanCancel(CompositeNodeGroup.java:101)
[05:43:04][Gradle failure report] at org.gradle.execution.plan.Node.isCanCancel(Node.java:232)
[05:43:04][Gradle failure report] at org.gradle.execution.plan.FinalizerGroup.isCanCancel(FinalizerGroup.java:155)
[05:43:04][Gradle failure report] at org.gradle.execution.plan.CompositeNodeGroup.isCanCancel(CompositeNodeGroup.java:101)
[05:43:04][Gradle failure report] at org.gradle.execution.plan.Node.isCanCancel(Node.java:232)
[05:43:04][Gradle failure report] at org.gradle.execution.plan.FinalizerGroup.isCanCancel(FinalizerGroup.java:155)
[05:43:04][Gradle failure report] at org.gradle.execution.plan.CompositeNodeGroup.isCanCancel(CompositeNodeGroup.java:101)
[05:43:04][Gradle failure report] at org.gradle.execution.plan.Node.isCanCancel(Node.java:232)
[05:43:04][Gradle failure report] at org.gradle.execution.plan.FinalizerGroup.isCanCancel(FinalizerGroup.java:155)
[05:43:04][Gradle failure report] at org.gradle.execution.plan.CompositeNodeGroup.isCanCancel(CompositeNodeGroup.java:101)
[05:43:04][Gradle failure report] at org.gradle.execution.plan.Node.isCanCancel(Node.java:232)
[05:43:04][Gradle failure report] at org.gradle.execution.plan.FinalizerGroup.isCanCancel(FinalizerGroup.java:155)
[05:43:04][Gradle failure report] at org.gradle.execution.plan.CompositeNodeGroup.isCanCancel(CompositeNodeGroup.java:101)
[05:43:04][Gradle failure report] at org.gradle.execution.plan.Node.isCanCancel(Node.java:232)
[05:43:04][Gradle failure report] at org.gradle.execution.plan.FinalizerGroup.isCanCancel(FinalizerGroup.java:155)
[05:43:04][Gradle failure report] at org.gradle.execution.plan.CompositeNodeGroup.isCanCancel(CompositeNodeGroup.java:101)
[05:43:04][Gradle failure report] at org.gradle.execution.plan.Node.isCanCancel(Node.java:232)
[05:43:04][Gradle failure report] at org.gradle.execution.plan.FinalizerGroup.isCanCancel(FinalizerGroup.java:155)
[05:43:04][Gradle failure report] at org.gradle.execution.plan.CompositeNodeGroup.isCanCancel(CompositeNodeGroup.java:101)
[05:43:04][Gradle failure report] at org.gradle.execution.plan.Node.isCanCancel(Node.java:232)
[05:43:04][Gradle failure report] at org.gradle.execution.plan.FinalizerGroup.isCanCancel(FinalizerGroup.java:155)
[05:43:04][Gradle failure report] at org.gradle.execution.plan.CompositeNodeGroup.isCanCancel(CompositeNodeGroup.java:101)
[05:43:04][Gradle failure report] at org.gradle.execution.plan.Node.isCanCancel(Node.java:232)
[05:43:04][Gradle failure report] at org.gradle.execution.plan.FinalizerGroup.isCanCancel(FinalizerGroup.java:155)
[05:43:04][Gradle failure report] at org.gradle.execution.plan.CompositeNodeGroup.isCanCancel(CompositeNodeGroup.java:101)
[05:43:04][Gradle failure report] at org.gradle.execution.plan.Node.isCanCancel(Node.java:232)
[05:43:04][Gradle failure report] at org.gradle.execution.plan.FinalizerGroup.isCanCancel(FinalizerGroup.java:155)
[05:43:04][Gradle failure report] at org.gradle.execution.plan.CompositeNodeGroup.isCanCancel(CompositeNodeGroup.java:101)
[05:43:04][Gradle failure report] at org.gradle.execution.plan.Node.isCanCancel(Node.java:232)
[05:43:04][Gradle failure report] at org.gradle.execution.plan.FinalizerGroup.isCanCancel(FinalizerGroup.java:155)
[05:43:04][Gradle failure report] at org.gradle.execution.plan.CompositeNodeGroup.isCanCancel(CompositeNodeGroup.java:101)
[05:43:04][Gradle failure report] at org.gradle.execution.plan.Node.isCanCancel(Node.java:232)
[05:43:04][Gradle failure report] at org.gradle.execution.plan.FinalizerGroup.isCanCancel(FinalizerGroup.java:155)
[05:43:04][Gradle failure report] at org.gradle.execution.plan.CompositeNodeGroup.isCanCancel(CompositeNodeGroup.java:101)
[05:43:04][Gradle failure report] at org.gradle.execution.plan.Node.isCanCancel(Node.java:232)
[05:43:04][Gradle failure report] at org.gradle.execution.plan.FinalizerGroup.isCanCancel(FinalizerGroup.java:155)
[05:43:04][Gradle failure report] at org.gradle.execution.plan.CompositeNodeGroup.isCanCancel(CompositeNodeGroup.java:101)
[05:43:04][Gradle failure report] at org.gradle.execution.plan.Node.isCanCancel(Node.java:232)
[05:43:04][Gradle failure report] at org.gradle.execution.plan.FinalizerGroup.isCanCancel(FinalizerGroup.java:155)
[05:43:04][Gradle failure report] at org.gradle.execution.plan.CompositeNodeGroup.isCanCancel(CompositeNodeGroup.java:101)
[05:43:04][Gradle failure report] at org.gradle.execution.plan.Node.isCanCancel(Node.java:232)
[05:43:04][Gradle failure report] at org.gradle.execution.plan.FinalizerGroup.isCanCancel(FinalizerGroup.java:155)
[05:43:04][Gradle failure report] at org.gradle.execution.plan.CompositeNodeGroup.isCanCancel(CompositeNodeGroup.java:101)
[05:43:04][Gradle failure report] at org.gradle.execution.plan.Node.isCanCancel(Node.java:232)
[05:43:04][Gradle failure report] at org.gradle.execution.plan.FinalizerGroup.isCanCancel(FinalizerGroup.java:155)
[05:43:04][Gradle failure report] at org.gradle.execution.plan.CompositeNodeGroup.isCanCancel(CompositeNodeGroup.java:101)
[05:43:04][Gradle failure report] at org.gradle.execution.plan.Node.isCanCancel(Node.java:232)
[05:43:04][Gradle failure report] at org.gradle.execution.plan.FinalizerGroup.isCanCancel(FinalizerGroup.java:155)
[05:43:04][Gradle failure report] at org.gradle.execution.plan.CompositeNodeGroup.isCanCancel(CompositeNodeGroup.java:101)
[05:43:04][Gradle failure report] at org.gradle.execution.plan.Node.isCanCancel(Node.java:232)
[05:43:04][Gradle failure report] at org.gradle.execution.plan.FinalizerGroup.isCanCancel(FinalizerGroup.java:155)
[05:43:04][Gradle failure report] at org.gradle.execution.plan.CompositeNodeGroup.isCanCancel(CompositeNodeGroup.java:101)
[05:43:04][Gradle failure report] at org.gradle.execution.plan.Node.isCanCancel(Node.java:232)
[05:43:04][Gradle failure report] at org.gradle.execution.plan.FinalizerGroup.isCanCancel(FinalizerGroup.java:155)
[05:43:04][Gradle failure report] at org.gradle.execution.plan.CompositeNodeGroup.isCanCancel(CompositeNodeGroup.java:101)
[05:43:04][Gradle failure report] at org.gradle.execution.plan.Node.isCanCancel(Node.java:232)
[05:43:04][Gradle failure report] at org.gradle.execution.plan.FinalizerGroup.isCanCancel(FinalizerGroup.java:155)
[05:43:04][Gradle failure report] at org.gradle.execution.plan.CompositeNodeGroup.isCanCancel(CompositeNodeGroup.java:101)
[05:43:04][Gradle failure report] at org.gradle.execution.plan.Node.isCanCancel(Node.java:232)
[05:43:04][Gradle failure report] at org.gradle.execution.plan.FinalizerGroup.isCanCancel(FinalizerGroup.java:155)
[05:43:04][Gradle failure report] at org.gradle.execution.plan.CompositeNodeGroup.isCanCancel(CompositeNodeGroup.java:101)
[05:43:04][Gradle failure report] at org.gradle.execution.plan.Node.isCanCancel(Node.java:232)
[05:43:04][Gradle failure report] at org.gradle.execution.plan.FinalizerGroup.isCanCancel(FinalizerGroup.java:155)
[05:43:04][Gradle failure report] at org.gradle.execution.plan.CompositeNodeGroup.isCanCancel(CompositeNodeGroup.java:101)
[05:43:04][Gradle failure report] at org.gradle.execution.plan.Node.isCanCancel(Node.java:232)
[05:43:04][Gradle failure report] at org.gradle.execution.plan.FinalizerGroup.isCanCancel(FinalizerGroup.java:155)
[05:43:04][Gradle failure report] at org.gradle.execution.plan.CompositeNodeGroup.isCanCancel(CompositeNodeGroup.java:101)
[05:43:04][Gradle failure report] at org.gradle.execution.plan.Node.isCanCancel(Node.java:232)
[05:43:04][Gradle failure report] at org.gradle.execution.plan.FinalizerGroup.isCanCancel(FinalizerGroup.java:155)
[05:43:04][Gradle failure report] at org.gradle.execution.plan.CompositeNodeGroup.isCanCancel(CompositeNodeGroup.java:101)
[05:43:04][Gradle failure report] at org.gradle.execution.plan.Node.isCanCancel(Node.java:232)
[05:43:04][Gradle failure report] at org.gradle.execution.plan.FinalizerGroup.isCanCancel(FinalizerGroup.java:155)
[05:43:04][Gradle failure report] at org.gradle.execution.plan.CompositeNodeGroup.isCanCancel(CompositeNodeGroup.java:101)
[05:43:04][Gradle failure report] at org.gradle.execution.plan.Node.isCanCancel(Node.java:232)
[05:43:04][Gradle failure report] at org.gradle.execution.plan.FinalizerGroup.isCanCancel(FinalizerGroup.java:155)
[05:43:04][Gradle failure report] at org.gradle.execution.plan.CompositeNodeGroup.isCanCancel(CompositeNodeGroup.java:101)
[05:43:04][Gradle failure report] at org.gradle.execution.plan.Node.isCanCancel(Node.java:232)
[05:43:04][Gradle failure report] at org.gradle.execution.plan.FinalizerGroup.isCanCancel(FinalizerGroup.java:155)
[05:43:04][Gradle failure report] at org.gradle.execution.plan.CompositeNodeGroup.isCanCancel(CompositeNodeGroup.java:101)
[05:43:04][Gradle failure report] at org.gradle.execution.plan.Node.isCanCancel(Node.java:232)
[05:43:04][Gradle failure report] at org.gradle.execution.plan.FinalizerGroup.isCanCancel(FinalizerGroup.java:155)
[05:43:04][Gradle failure report] at org.gradle.execution.plan.CompositeNodeGroup.isCanCancel(CompositeNodeGroup.java:101)
[05:43:04][Gradle failure report] at org.gradle.execution.plan.Node.isCanCancel(Node.java:232)
[05:43:04][Gradle failure report] at org.gradle.execution.plan.FinalizerGroup.isCanCancel(FinalizerGroup.java:155)
[05:43:04][Gradle failure report] at org.gradle.execution.plan.CompositeNodeGroup.isCanCancel(CompositeNodeGroup.java:101)
[05:43:04][Gradle failure report] at org.gradle.execution.plan.Node.isCanCancel(Node.java:232)
[05:43:04][Gradle failure report] at org.gradle.execution.plan.FinalizerGroup.isCanCancel(FinalizerGroup.java:155)
[05:43:04][Gradle failure report] at org.gradle.execution.plan.CompositeNodeGroup.isCanCancel(CompositeNodeGroup.java:101)
[05:43:04][Gradle failure report] at org.gradle.execution.plan.Node.isCanCancel(Node.java:232)
[05:43:04][Gradle failure report] at org.gradle.execution.plan.FinalizerGroup.isCanCancel(FinalizerGroup.java:155)
[05:43:04][Gradle failure report] at org.gradle.execution.plan.CompositeNodeGroup.isCanCancel(CompositeNodeGroup.java:101)
[05:43:04][Gradle failure report] at org.gradle.execution.plan.Node.isCanCancel(Node.java:232)
[05:43:04][Gradle failure report] at org.gradle.execution.plan.FinalizerGroup.isCanCancel(FinalizerGroup.java:155)
[05:43:04][Gradle failure report] at org.gradle.execution.plan.CompositeNodeGroup.isCanCancel(CompositeNodeGroup.java:101)
[05:43:04][Gradle failure report] at org.gradle.execution.plan.Node.isCanCancel(Node.java:232)
[05:43:04][Gradle failure report] at org.gradle.execution.plan.FinalizerGroup.isCanCancel(FinalizerGroup.java:155)
[05:43:04][Gradle failure report] at org.gradle.execution.plan.CompositeNodeGroup.isCanCancel(CompositeNodeGroup.java:101)
[05:43:04][Gradle failure report] at org.gradle.execution.plan.Node.isCanCancel(Node.java:232)
[05:43:04][Gradle failure report] at org.gradle.execution.plan.FinalizerGroup.isCanCancel(FinalizerGroup.java:155)
[05:43:04][Gradle failure report] at org.gradle.execution.plan.CompositeNodeGroup.isCanCancel(CompositeNodeGroup.java:101)
[05:43:04][Gradle failure report] at org.gradle.execution.plan.Node.isCanCancel(Node.java:232)
[05:43:04][Gradle failure report] at org.gradle.execution.plan.FinalizerGroup.isCanCancel(FinalizerGroup.java:155)
[05:43:04][Gradle failure report] at org.gradle.execution.plan.CompositeNodeGroup.isCanCancel(CompositeNodeGroup.java:101)
[05:43:04][Gradle failure report] at org.gradle.execution.plan.Node.isCanCancel(Node.java:232)
[05:43:04][Gradle failure report] at org.gradle.execution.plan.FinalizerGroup.isCanCancel(FinalizerGroup.java:155)
[05:43:04][Gradle failure report] at org.gradle.execution.plan.CompositeNodeGroup.isCanCancel(CompositeNodeGroup.java:101)
[05:43:04][Gradle failure report] at org.gradle.execution.plan.Node.isCanCancel(Node.java:232)
[05:43:04][Gradle failure report] at org.gradle.execution.plan.FinalizerGroup.isCanCancel(FinalizerGroup.java:155)
[05:43:04][Gradle failure report] at org.gradle.execution.plan.CompositeNodeGroup.isCanCancel(CompositeNodeGroup.java:101)
[05:43:04][Gradle failure report] at org.gradle.execution.plan.Node.isCanCancel(Node.java:232)
[05:43:04][Gradle failure report] at org.gradle.execution.plan.FinalizerGroup.isCanCancel(FinalizerGroup.java:155)
[05:43:04][Gradle failure report] at org.gradle.execution.plan.CompositeNodeGroup.isCanCancel(CompositeNodeGroup.java:101)
[05:43:04][Gradle failure report] at org.gradle.execution.plan.Node.isCanCancel(Node.java:232)
[05:43:04][Gradle failure report] at org.gradle.execution.plan.FinalizerGroup.isCanCancel(FinalizerGroup.java:155)
[05:43:04][Gradle failure report] at org.gradle.execution.plan.CompositeNodeGroup.isCanCancel(CompositeNodeGroup.java:101)
[05:43:04][Gradle failure report] at org.gradle.execution.plan.Node.isCanCancel(Node.java:232)
[05:43:04][Gradle failure report] at org.gradle.execution.plan.FinalizerGroup.isCanCancel(FinalizerGroup.java:155)
[05:43:04][Gradle failure report] at org.gradle.execution.plan.CompositeNodeGroup.isCanCancel(CompositeNodeGroup.java:101)
[05:43:04][Gradle failure report] at org.gradle.execution.plan.Node.isCanCancel(Node.java:232)
[05:43:04][Gradle failure report] at org.gradle.execution.plan.FinalizerGroup.isCanCancel(FinalizerGroup.java:155)
[05:43:04][Gradle failure report] at org.gradle.execution.plan.CompositeNodeGroup.isCanCancel(CompositeNodeGroup.java:101)
[05:43:04][Gradle failure report] at org.gradle.execution.plan.Node.isCanCancel(Node.java:232)
[05:43:04][Gradle failure report] at org.gradle.execution.plan.FinalizerGroup.isCanCancel(FinalizerGroup.java:155)
[05:43:04][Gradle failure report] at org.gradle.execution.plan.CompositeNodeGroup.isCanCancel(CompositeNodeGroup.java:101)
[05:43:04][Gradle failure report] at org.gradle.execution.plan.Node.isCanCancel(Node.java:232)
[05:43:04][Gradle failure report] at org.gradle.execution.plan.FinalizerGroup.isCanCancel(FinalizerGroup.java:155)
[05:43:04][Gradle failure report] at org.gradle.execution.plan.CompositeNodeGroup.isCanCancel(CompositeNodeGroup.java:101)
[05:43:04][Gradle failure report] at org.gradle.execution.plan.Node.isCanCancel(Node.java:232)
[05:43:04][Gradle failure report] at org.gradle.execution.plan.FinalizerGroup.isCanCancel(FinalizerGroup.java:155)
[05:43:04][Gradle failure report] at org.gradle.execution.plan.CompositeNodeGroup.isCanCancel(CompositeNodeGroup.java:101)
[05:43:04][Gradle failure report] at org.gradle.execution.plan.Node.isCanCancel(Node.java:232)
[05:43:04][Gradle failure report] at org.gradle.execution.plan.FinalizerGroup.isCanCancel(FinalizerGroup.java:155)
[05:43:04][Gradle failure report] at org.gradle.execution.plan.CompositeNodeGroup.isCanCancel(CompositeNodeGroup.java:101)
[05:43:04][Gradle failure report] at org.gradle.execution.plan.Node.isCanCancel(Node.java:232)
[05:43:04][Gradle failure report] at org.gradle.execution.plan.FinalizerGroup.isCanCancel(FinalizerGroup.java:155)
[05:43:04][Gradle failure report] at org.gradle.execution.plan.CompositeNodeGroup.isCanCancel(CompositeNodeGroup.java:101)
[05:43:04][Gradle failure report] at org.gradle.execution.plan.Node.isCanCancel(Node.java:232)
[05:43:04][Gradle failure report] at org.gradle.execution.plan.FinalizerGroup.isCanCancel(FinalizerGroup.java:155)
[05:43:04][Gradle failure report] at org.gradle.execution.plan.CompositeNodeGroup.isCanCancel(CompositeNodeGroup.java:101)
[05:43:04][Gradle failure report] at org.gradle.execution.plan.Node.isCanCancel(Node.java:232)
[05:43:04][Gradle failure report] at org.gradle.execution.plan.FinalizerGroup.isCanCancel(FinalizerGroup.java:155)
[05:43:04][Gradle failure report] at org.gradle.execution.plan.CompositeNodeGroup.isCanCancel(CompositeNodeGroup.java:101)
[05:43:04][Gradle failure report] at org.gradle.execution.plan.Node.isCanCancel(Node.java:232)
[05:43:04][Gradle failure report] at org.gradle.execution.plan.FinalizerGroup.isCanCancel(FinalizerGroup.java:155)
[05:43:04][Gradle failure report] at org.gradle.execution.plan.CompositeNodeGroup.isCanCancel(CompositeNodeGroup.java:101)
[05:43:04][Gradle failure report] at org.gradle.execution.plan.Node.isCanCancel(Node.java:232)
[05:43:04][Gradle failure report] at org.gradle.execution.plan.FinalizerGroup.isCanCancel(FinalizerGroup.java:155)
[05:43:04][Gradle failure report] at org.gradle.execution.plan.CompositeNodeGroup.isCanCancel(CompositeNodeGroup.java:101)
[05:43:04][Gradle failure report] at org.gradle.execution.plan.Node.isCanCancel(Node.java:232)
[05:43:04][Gradle failure report] at org.gradle.execution.plan.FinalizerGroup.isCanCancel(FinalizerGroup.java:155)
[05:43:04][Gradle failure report] at org.gradle.execution.plan.CompositeNodeGroup.isCanCancel(CompositeNodeGroup.java:101)
[05:43:04][Gradle failure report] at org.gradle.execution.plan.Node.isCanCancel(Node.java:232)
[05:43:04][Gradle failure report] at org.gradle.execution.plan.FinalizerGroup.isCanCancel(FinalizerGroup.java:155)
[05:43:04][Gradle failure report] at org.gradle.execution.plan.CompositeNodeGroup.isCanCancel(CompositeNodeGroup.java:101)
[05:43:04][Gradle failure report] at org.gradle.execution.plan.Node.isCanCancel(Node.java:232)
[05:43:04][Gradle failure report] at org.gradle.execution.plan.FinalizerGroup.isCanCancel(FinalizerGroup.java:155)
[05:43:04][Gradle failure report] at org.gradle.execution.plan.CompositeNodeGroup.isCanCancel(CompositeNodeGroup.java:101)
[05:43:04][Gradle failure report] at org.gradle.execution.plan.Node.isCanCancel(Node.java:232)
[05:43:04][Gradle failure report] at org.gradle.execution.plan.FinalizerGroup.isCanCancel(FinalizerGroup.java:155)
[05:43:04][Gradle failure report] at org.gradle.execution.plan.CompositeNodeGroup.isCanCancel(CompositeNodeGroup.java:101)
[05:43:04][Gradle failure report] at org.gradle.execution.plan.Node.isCanCancel(Node.java:232)
[05:43:04][Gradle failure report] at org.gradle.execution.plan.FinalizerGroup.isCanCancel(FinalizerGroup.java:155)
[05:43:04][Gradle failure report] at org.gradle.execution.plan.CompositeNodeGroup.isCanCancel(CompositeNodeGroup.java:101)
[05:43:04][Gradle failure report] at org.gradle.execution.plan.Node.isCanCancel(Node.java:232)
[05:43:04][Gradle failure report] at org.gradle.execution.plan.FinalizerGroup.isCanCancel(FinalizerGroup.java:155)
[05:43:04][Gradle failure report] at org.gradle.execution.plan.CompositeNodeGroup.isCanCancel(CompositeNodeGroup.java:101)
[05:43:04][Gradle failure report] at org.gradle.execution.plan.Node.isCanCancel(Node.java:232)
[05:43:04][Gradle failure report] at org.gradle.execution.plan.FinalizerGroup.isCanCancel(FinalizerGroup.java:155)
[05:43:04][Gradle failure report] at org.gradle.execution.plan.CompositeNodeGroup.isCanCancel(CompositeNodeGroup.java:101)
[05:43:04][Gradle failure report] at org.gradle.execution.plan.Node.isCanCancel(Node.java:232)
[05:43:04][Gradle failure report] at org.gradle.execution.plan.FinalizerGroup.isCanCancel(FinalizerGroup.java:155)
[05:43:04][Gradle failure report] at org.gradle.execution.plan.CompositeNodeGroup.isCanCancel(CompositeNodeGroup.java:101)
[05:43:04][Gradle failure report] at org.gradle.execution.plan.Node.isCanCancel(Node.java:232)
[05:43:04][Gradle failure report] at org.gradle.execution.plan.FinalizerGroup.isCanCancel(FinalizerGroup.java:155)
[05:43:04][Gradle failure report] at org.gradle.execution.plan.CompositeNodeGroup.isCanCancel(CompositeNodeGroup.java:101)
[05:43:04][Gradle failure report] at org.gradle.execution.plan.Node.isCanCancel(Node.java:232)
[05:43:04][Gradle failure report] at org.gradle.execution.plan.FinalizerGroup.isCanCancel(FinalizerGroup.java:155)
[05:43:04][Gradle failure report] at org.gradle.execution.plan.CompositeNodeGroup.isCanCancel(CompositeNodeGroup.java:101)
[05:43:04][Gradle failure report] at org.gradle.execution.plan.Node.isCanCancel(Node.java:232)
[05:43:04][Gradle failure report] at org.gradle.execution.plan.FinalizerGroup.isCanCancel(FinalizerGroup.java:155)
[05:43:04][Gradle failure report] at org.gradle.execution.plan.CompositeNodeGroup.isCanCancel(CompositeNodeGroup.java:101)
[05:43:04][Gradle failure report] at org.gradle.execution.plan.Node.isCanCancel(Node.java:232)
[05:43:04][Gradle failure report] at org.gradle.execution.plan.FinalizerGroup.isCanCancel(FinalizerGroup.java:155)
[05:43:04][Gradle failure report] at org.gradle.execution.plan.CompositeNodeGroup.isCanCancel(CompositeNodeGroup.java:101)
[05:43:04][Gradle failure report] at org.gradle.execution.plan.Node.isCanCancel(Node.java:232)
[05:43:04][Gradle failure report] at org.gradle.execution.plan.FinalizerGroup.isCanCancel(FinalizerGroup.java:155)
[05:43:04][Gradle failure report] at org.gradle.execution.plan.CompositeNodeGroup.isCanCancel(CompositeNodeGroup.java:101)
[05:43:04][Gradle failure report] at org.gradle.execution.plan.Node.isCanCancel(Node.java:232)
[05:43:04][Gradle failure report] at org.gradle.execution.plan.FinalizerGroup.isCanCancel(FinalizerGroup.java:155)
[05:43:04][Gradle failure report] at org.gradle.execution.plan.CompositeNodeGroup.isCanCancel(CompositeNodeGroup.java:101)
[05:43:04][Gradle failure report] at org.gradle.execution.plan.Node.isCanCancel(Node.java:232)
[05:43:04][Gradle failure report] at org.gradle.execution.plan.FinalizerGroup.isCanCancel(FinalizerGroup.java:155)
[05:43:04][Gradle failure report] at org.gradle.execution.plan.CompositeNodeGroup.isCanCancel(CompositeNodeGroup.java:101)
[05:43:04][Gradle failure report] at org.gradle.execution.plan.Node.isCanCancel(Node.java:232)
[05:43:04][Gradle failure report] at org.gradle.execution.plan.FinalizerGroup.isCanCancel(FinalizerGroup.java:155)
[05:43:04][Gradle failure report] at org.gradle.execution.plan.CompositeNodeGroup.isCanCancel(CompositeNodeGroup.java:101)
[05:43:04][Gradle failure report] at org.gradle.execution.plan.Node.isCanCancel(Node.java:232)
[05:43:04][Gradle failure report] at org.gradle.execution.plan.FinalizerGroup.isCanCancel(FinalizerGroup.java:155)
[05:43:04][Gradle failure report] at org.gradle.execution.plan.CompositeNodeGroup.isCanCancel(CompositeNodeGroup.java:101)
[05:43:04][Gradle failure report] at org.gradle.execution.plan.Node.isCanCancel(Node.java:232)
[05:43:04][Gradle failure report] at org.gradle.execution.plan.FinalizerGroup.isCanCancel(FinalizerGroup.java:155)
[05:43:04][Gradle failure report] at org.gradle.execution.plan.CompositeNodeGroup.isCanCancel(CompositeNodeGroup.java:101)
[05:43:04][Gradle failure report] at org.gradle.execution.plan.Node.isCanCancel(Node.java:232)
[05:43:04][Gradle failure report] at org.gradle.execution.plan.FinalizerGroup.isCanCancel(FinalizerGroup.java:155)
[05:43:04][Gradle failure report] at org.gradle.execution.plan.CompositeNodeGroup.isCanCancel(CompositeNodeGroup.java:101)
[05:43:04][Gradle failure report] at org.gradle.execution.plan.Node.isCanCancel(Node.java:232)
[05:43:04][Gradle failure report] at org.gradle.execution.plan.FinalizerGroup.isCanCancel(FinalizerGroup.java:155)
[05:43:04][Gradle failure report] at org.gradle.execution.plan.CompositeNodeGroup.isCanCancel(CompositeNodeGroup.java:101)
[05:43:04][Gradle failure report] at org.gradle.execution.plan.Node.isCanCancel(Node.java:232)
[05:43:04][Gradle failure report] at org.gradle.execution.plan.FinalizerGroup.isCanCancel(FinalizerGroup.java:155)
[05:43:04][Gradle failure report] at org.gradle.execution.plan.CompositeNodeGroup.isCanCancel(CompositeNodeGroup.java:101)
[05:43:04][Gradle failure report] at org.gradle.execution.plan.Node.isCanCancel(Node.java:232)
[05:43:04][Gradle failure report] at org.gradle.execution.plan.FinalizerGroup.isCanCancel(FinalizerGroup.java:155)
[05:43:04][Gradle failure report] at org.gradle.execution.plan.CompositeNodeGroup.isCanCancel(CompositeNodeGroup.java:101)
[05:43:04][Gradle failure report] at org.gradle.execution.plan.Node.isCanCancel(Node.java:232)
[05:43:04][Gradle failure report] at org.gradle.execution.plan.FinalizerGroup.isCanCancel(FinalizerGroup.java:155)
[05:43:04][Gradle failure report] at org.gradle.execution.plan.CompositeNodeGroup.isCanCancel(CompositeNodeGroup.java:101)
[05:43:04][Gradle failure report] at org.gradle.execution.plan.Node.isCanCancel(Node.java:232)
[05:43:04][Gradle failure report] at org.gradle.execution.plan.FinalizerGroup.isCanCancel(FinalizerGroup.java:155)
[05:43:04][Gradle failure report] at org.gradle.execution.plan.CompositeNodeGroup.isCanCancel(CompositeNodeGroup.java:101)
[05:43:04][Gradle failure report] at org.gradle.execution.plan.Node.isCanCancel(Node.java:232)
[05:43:04][Gradle failure report] at org.gradle.execution.plan.FinalizerGroup.isCanCancel(FinalizerGroup.java:155)
[05:43:04][Gradle failure report] at org.gradle.execution.plan.CompositeNodeGroup.isCanCancel(CompositeNodeGroup.java:101)
[05:43:04][Gradle failure report] at org.gradle.execution.plan.Node.isCanCancel(Node.java:232)
[05:43:04][Gradle failure report] at org.gradle.execution.plan.FinalizerGroup.isCanCancel(FinalizerGroup.java:155)
[05:43:04][Gradle failure report] at org.gradle.execution.plan.CompositeNodeGroup.isCanCancel(CompositeNodeGroup.java:101)
[05:43:04][Gradle failure report] at org.gradle.execution.plan.Node.isCanCancel(Node.java:232)
[05:43:04][Gradle failure report] at org.gradle.execution.plan.FinalizerGroup.isCanCancel(FinalizerGroup.java:155)
[05:43:04][Gradle failure report] at org.gradle.execution.plan.CompositeNodeGroup.isCanCancel(CompositeNodeGroup.java:101)
[05:43:04][Gradle failure report] at org.gradle.execution.plan.Node.isCanCancel(Node.java:232)
[05:43:04][Gradle failure report] at org.gradle.execution.plan.FinalizerGroup.isCanCancel(FinalizerGroup.java:155)
[05:43:04][Gradle failure report] at org.gradle.execution.plan.CompositeNodeGroup.isCanCancel(CompositeNodeGroup.java:101)
[05:43:04][Gradle failure report] at org.gradle.execution.plan.Node.isCanCancel(Node.java:232)
[05:43:04][Gradle failure report] at org.gradle.execution.plan.FinalizerGroup.isCanCancel(FinalizerGroup.java:155)
[05:43:04][Gradle failure report] at org.gradle.execution.plan.CompositeNodeGroup.isCanCancel(CompositeNodeGroup.java:101)
[05:43:04][Gradle failure report] at org.gradle.execution.plan.Node.isCanCancel(Node.java:232)
[05:43:04][Gradle failure report] at org.gradle.execution.plan.FinalizerGroup.isCanCancel(FinalizerGroup.java:155)
[05:43:04][Gradle failure report] at org.gradle.execution.plan.CompositeNodeGroup.isCanCancel(CompositeNodeGroup.java:101)
[05:43:04][Gradle failure report] at org.gradle.execution.plan.Node.isCanCancel(Node.java:232)
[05:43:04][Gradle failure report] at org.gradle.execution.plan.FinalizerGroup.isCanCancel(FinalizerGroup.java:155)
[05:43:04][Gradle failure report] at org.gradle.execution.plan.CompositeNodeGroup.isCanCancel(CompositeNodeGroup.java:101)
[05:43:04][Gradle failure report] at org.gradle.execution.plan.Node.isCanCancel(Node.java:232)
[05:43:04][Gradle failure report] at org.gradle.execution.plan.FinalizerGroup.isCanCancel(FinalizerGroup.java:155)
[05:43:04][Gradle failure report] at org.gradle.execution.plan.CompositeNodeGroup.isCanCancel(CompositeNodeGroup.java:101)
[05:43:04][Gradle failure report] at org.gradle.execution.plan.Node.isCanCancel(Node.java:232)
[05:43:04][Gradle failure report] at org.gradle.execution.plan.FinalizerGroup.isCanCancel(FinalizerGroup.java:155)
[05:43:04][Gradle failure report] at org.gradle.execution.plan.CompositeNodeGroup.isCanCancel(CompositeNodeGroup.java:101)
[05:43:04][Gradle failure report] at org.gradle.execution.plan.Node.isCanCancel(Node.java:232)
[05:43:04][Gradle failure report] at org.gradle.execution.plan.FinalizerGroup.isCanCancel(FinalizerGroup.java:155)
[05:43:04][Gradle failure report] at org.gradle.execution.plan.CompositeNodeGroup.isCanCancel(CompositeNodeGroup.java:101)
[05:43:04][Gradle failure report] at org.gradle.execution.plan.Node.isCanCancel(Node.java:232)
[05:43:04][Gradle failure report] at org.gradle.execution.plan.FinalizerGroup.isCanCancel(FinalizerGroup.java:155)
[05:43:04][Gradle failure report] at org.gradle.execution.plan.CompositeNodeGroup.isCanCancel(CompositeNodeGroup.java:101)
[05:43:04][Gradle failure report] at org.gradle.execution.plan.Node.isCanCancel(Node.java:232)
[05:43:04][Gradle failure report] at org.gradle.execution.plan.FinalizerGroup.isCanCancel(FinalizerGroup.java:155)
[05:43:04][Gradle failure report] at org.gradle.execution.plan.CompositeNodeGroup.isCanCancel(CompositeNodeGroup.java:101)
[05:43:04][Gradle failure report] at org.gradle.execution.plan.Node.isCanCancel(Node.java:232)
[05:43:04][Gradle failure report] at org.gradle.execution.plan.FinalizerGroup.isCanCancel(FinalizerGroup.java:155)
[05:43:04][Gradle failure report] at org.gradle.execution.plan.CompositeNodeGroup.isCanCancel(CompositeNodeGroup.java:101)
[05:43:04][Gradle failure report] at org.gradle.execution.plan.Node.isCanCancel(Node.java:232)
[05:43:04][Gradle failure report] at org.gradle.execution.plan.FinalizerGroup.isCanCancel(FinalizerGroup.java:155)
[05:43:04][Gradle failure report] at org.gradle.execution.plan.CompositeNodeGroup.isCanCancel(CompositeNodeGroup.java:101)
[05:43:04][Gradle failure report] at org.gradle.execution.plan.Node.isCanCancel(Node.java:232)
[05:43:04][Gradle failure report] at org.gradle.execution.plan.FinalizerGroup.isCanCancel(FinalizerGroup.java:155)
[05:43:04][Gradle failure report] at org.gradle.execution.plan.CompositeNodeGroup.isCanCancel(CompositeNodeGroup.java:101)
[05:43:04][Gradle failure report] at org.gradle.execution.plan.Node.isCanCancel(Node.java:232)
[05:43:04][Gradle failure report] at org.gradle.execution.plan.FinalizerGroup.isCanCancel(FinalizerGroup.java:155)
[05:43:04][Gradle failure report] at org.gradle.execution.plan.CompositeNodeGroup.isCanCancel(CompositeNodeGroup.java:101)
[05:43:04][Gradle failure report] at org.gradle.execution.plan.Node.isCanCancel(Node.java:232)
[05:43:04][Gradle failure report] at org.gradle.execution.plan.FinalizerGroup.isCanCancel(FinalizerGroup.java:155)
[05:43:04][Gradle failure report] at org.gradle.execution.plan.CompositeNodeGroup.isCanCancel(CompositeNodeGroup.java:101)
[05:43:04][Gradle failure report] at org.gradle.execution.plan.Node.isCanCancel(Node.java:232)
[05:43:04][Gradle failure report] at org.gradle.execution.plan.FinalizerGroup.isCanCancel(FinalizerGroup.java:155)
[05:43:04][Gradle failure report] at org.gradle.execution.plan.CompositeNodeGroup.isCanCancel(CompositeNodeGroup.java:101)
[05:43:04][Gradle failure report] at org.gradle.execution.plan.Node.isCanCancel(Node.java:232)
[05:43:04][Gradle failure report] at org.gradle.execution.plan.FinalizerGroup.isCanCancel(FinalizerGroup.java:155)
[05:43:04][Gradle failure report] at org.gradle.execution.plan.CompositeNodeGroup.isCanCancel(CompositeNodeGroup.java:101)
[05:43:04][Gradle failure report] at org.gradle.execution.plan.Node.isCanCancel(Node.java:232)
[05:43:04][Gradle failure report] at org.gradle.execution.plan.FinalizerGroup.isCanCancel(FinalizerGroup.java:155)
[05:43:04][Gradle failure report] at org.gradle.execution.plan.CompositeNodeGroup.isCanCancel(CompositeNodeGroup.java:101)
[05:43:04][Gradle failure report] at org.gradle.execution.plan.Node.isCanCancel(Node.java:232)
[05:43:04][Gradle failure report] at org.gradle.execution.plan.FinalizerGroup.isCanCancel(FinalizerGroup.java:155)
[05:43:04][Gradle failure report] at org.gradle.execution.plan.CompositeNodeGroup.isCanCancel(CompositeNodeGroup.java:101)
[05:43:04][Gradle failure report] at org.gradle.execution.plan.Node.isCanCancel(Node.java:232)
[05:43:04][Gradle failure report] at org.gradle.execution.plan.FinalizerGroup.isCanCancel(FinalizerGroup.java:155)
[05:43:04][Gradle failure report] at org.gradle.execution.plan.CompositeNodeGroup.isCanCancel(CompositeNodeGroup.java:101)
[05:43:04][Gradle failure report] at org.gradle.execution.plan.Node.isCanCancel(Node.java:232)
[05:43:04][Gradle failure report] at org.gradle.execution.plan.FinalizerGroup.isCanCancel(FinalizerGroup.java:155)
[05:43:04][Gradle failure report] at org.gradle.execution.plan.CompositeNodeGroup.isCanCancel(CompositeNodeGroup.java:101)
[05:43:04][Gradle failure report] at org.gradle.execution.plan.Node.isCanCancel(Node.java:232)
[05:43:04][Gradle failure report] at org.gradle.execution.plan.FinalizerGroup.isCanCancel(FinalizerGroup.java:155)
[05:43:04][Gradle failure report] at org.gradle.execution.plan.CompositeNodeGroup.isCanCancel(CompositeNodeGroup.java:101)
[05:43:04][Gradle failure report] at org.gradle.execution.plan.Node.isCanCancel(Node.java:232)
[05:43:04][Gradle failure report] at org.gradle.execution.plan.FinalizerGroup.isCanCancel(FinalizerGroup.java:155)
[05:43:04][Gradle failure report] at org.gradle.execution.plan.CompositeNodeGroup.isCanCancel(CompositeNodeGroup.java:101)
[05:43:04][Gradle failure report] at org.gradle.execution.plan.Node.isCanCancel(Node.java:232)
[05:43:04][Gradle failure report] at org.gradle.execution.plan.FinalizerGroup.isCanCancel(FinalizerGroup.java:155)
[05:43:04][Gradle failure report] at org.gradle.execution.plan.CompositeNodeGroup.isCanCancel(CompositeNodeGroup.java:101)
[05:43:04][Gradle failure report] at org.gradle.execution.plan.Node.isCanCancel(Node.java:232)
[05:43:04][Gradle failure report] at org.gradle.execution.plan.FinalizerGroup.isCanCancel(FinalizerGroup.java:155)
[05:43:04][Gradle failure report] at org.gradle.execution.plan.CompositeNodeGroup.isCanCancel(CompositeNodeGroup.java:101)
[05:43:04][Gradle failure report] at org.gradle.execution.plan.Node.isCanCancel(Node.java:232)
[05:43:04][Gradle failure report] at org.gradle.execution.plan.FinalizerGroup.isCanCancel(FinalizerGroup.java:155)
[05:43:04][Gradle failure report] at org.gradle.execution.plan.CompositeNodeGroup.isCanCancel(CompositeNodeGroup.java:101)
[05:43:04][Gradle failure report] at org.gradle.execution.plan.Node.isCanCancel(Node.java:232)
[05:43:04][Gradle failure report] at org.gradle.execution.plan.FinalizerGroup.isCanCancel(FinalizerGroup.java:155)
[05:43:04][Gradle failure report] at org.gradle.execution.plan.CompositeNodeGroup.isCanCancel(CompositeNodeGroup.java:101)
[05:43:04][Gradle failure report] at org.gradle.execution.plan.Node.isCanCancel(Node.java:232)
[05:43:04][Gradle failure report] at org.gradle.execution.plan.FinalizerGroup.isCanCancel(FinalizerGroup.java:155)
[05:43:04][Gradle failure report] at org.gradle.execution.plan.CompositeNodeGroup.isCanCancel(CompositeNodeGroup.java:101)
[05:43:04][Gradle failure report] at org.gradle.execution.plan.Node.isCanCancel(Node.java:232)
[05:43:04][Gradle failure report] at org.gradle.execution.plan.FinalizerGroup.isCanCancel(FinalizerGroup.java:155)
[05:43:04][Gradle failure report] at org.gradle.execution.plan.CompositeNodeGroup.isCanCancel(CompositeNodeGroup.java:101)
[05:43:04][Gradle failure report] at org.gradle.execution.plan.Node.isCanCancel(Node.java:232)
[05:43:04][Gradle failure report] at org.gradle.execution.plan.FinalizerGroup.isCanCancel(FinalizerGroup.java:155)
[05:43:04][Gradle failure report] at org.gradle.execution.plan.CompositeNodeGroup.isCanCancel(CompositeNodeGroup.java:101)
[05:43:04][Gradle failure report] at org.gradle.execution.plan.Node.isCanCancel(Node.java:232)
[05:43:04][Gradle failure report] at org.gradle.execution.plan.FinalizerGroup.isCanCancel(FinalizerGroup.java:155)
[05:43:04][Gradle failure report] at org.gradle.execution.plan.CompositeNodeGroup.isCanCancel(CompositeNodeGroup.java:101)
[05:43:04][Gradle failure report] at org.gradle.execution.plan.Node.isCanCancel(Node.java:232)
[05:43:04][Gradle failure report] at org.gradle.execution.plan.FinalizerGroup.isCanCancel(FinalizerGroup.java:155)
[05:43:04][Gradle failure report] at org.gradle.execution.plan.CompositeNodeGroup.isCanCancel(CompositeNodeGroup.java:101)
[05:43:04][Gradle failure report] at org.gradle.execution.plan.Node.isCanCancel(Node.java:232)
[05:43:04][Gradle failure report] at org.gradle.execution.plan.FinalizerGroup.isCanCancel(FinalizerGroup.java:155)
[05:43:04][Gradle failure report] at org.gradle.execution.plan.CompositeNodeGroup.isCanCancel(CompositeNodeGroup.java:101)
[05:43:04][Gradle failure report] at org.gradle.execution.plan.Node.isCanCancel(Node.java:232)
[05:43:04][Gradle failure report] at org.gradle.execution.plan.FinalizerGroup.isCanCancel(FinalizerGroup.java:155)
[05:43:04][Gradle failure report] at org.gradle.execution.plan.CompositeNodeGroup.isCanCancel(CompositeNodeGroup.java:101)
[05:43:04][Gradle failure report] at org.gradle.execution.plan.Node.isCanCancel(Node.java:232)
[05:43:04][Gradle failure report] at org.gradle.execution.plan.FinalizerGroup.isCanCancel(FinalizerGroup.java:155)
[05:43:04][Gradle failure report] at org.gradle.execution.plan.CompositeNodeGroup.isCanCancel(CompositeNodeGroup.java:101)
[05:43:04][Gradle failure report] at org.gradle.execution.plan.Node.isCanCancel(Node.java:232)
[05:43:04][Gradle failure report] at org.gradle.execution.plan.FinalizerGroup.isCanCancel(FinalizerGroup.java:155)
[05:43:04][Gradle failure report] at org.gradle.execution.plan.CompositeNodeGroup.isCanCancel(CompositeNodeGroup.java:101)
[05:43:04][Gradle failure report] at org.gradle.execution.plan.Node.isCanCancel(Node.java:232)
[05:43:04][Gradle failure report] at org.gradle.execution.plan.FinalizerGroup.isCanCancel(FinalizerGroup.java:155)
[05:43:04][Gradle failure report] at org.gradle.execution.plan.CompositeNodeGroup.isCanCancel(CompositeNodeGroup.java:101)
[05:43:04][Gradle failure report] at org.gradle.execution.plan.Node.isCanCancel(Node.java:232)
[05:43:04][Gradle failure report] at org.gradle.execution.plan.FinalizerGroup.isCanCancel(FinalizerGroup.java:155)
[05:43:04][Gradle failure report] at org.gradle.execution.plan.CompositeNodeGroup.isCanCancel(CompositeNodeGroup.java:101)
[05:43:04][Gradle failure report] at org.gradle.execution.plan.Node.isCanCancel(Node.java:232)
[05:43:04][Gradle failure report] at org.gradle.execution.plan.FinalizerGroup.isCanCancel(FinalizerGroup.java:155)
[05:43:04][Gradle failure report] at org.gradle.execution.plan.CompositeNodeGroup.isCanCancel(CompositeNodeGroup.java:101)
[05:43:04][Gradle failure report] at org.gradle.execution.plan.Node.isCanCancel(Node.java:232)
[05:43:04][Gradle failure report] at org.gradle.execution.plan.FinalizerGroup.isCanCancel(FinalizerGroup.java:155)
[05:43:04][Gradle failure report] at org.gradle.execution.plan.CompositeNodeGroup.isCanCancel(CompositeNodeGroup.java:101)
[05:43:04][Gradle failure report] at org.gradle.execution.plan.Node.isCanCancel(Node.java:232)
[05:43:04][Gradle failure report] at org.gradle.execution.plan.FinalizerGroup.isCanCancel(FinalizerGroup.java:155)
[05:43:04][Gradle failure report] at org.gradle.execution.plan.CompositeNodeGroup.isCanCancel(CompositeNodeGroup.java:101)
[05:43:04][Gradle failure report] at org.gradle.execution.plan.Node.isCanCancel(Node.java:232)
[05:43:04][Gradle failure report] at org.gradle.execution.plan.FinalizerGroup.isCanCancel(FinalizerGroup.java:155)
[05:43:04][Gradle failure report] at org.gradle.execution.plan.CompositeNodeGroup.isCanCancel(CompositeNodeGroup.java:101)
[05:43:04][Gradle failure report] at org.gradle.execution.plan.Node.isCanCancel(Node.java:232)
[05:43:04][Gradle failure report] at org.gradle.execution.plan.FinalizerGroup.isCanCancel(FinalizerGroup.java:155)
[05:43:04][Gradle failure report] at org.gradle.execution.plan.CompositeNodeGroup.isCanCancel(CompositeNodeGroup.java:101)
[05:43:04][Gradle failure report] at org.gradle.execution.plan.Node.isCanCancel(Node.java:232)
[05:43:04][Gradle failure report] at org.gradle.execution.plan.FinalizerGroup.isCanCancel(FinalizerGroup.java:155)
[05:43:04][Gradle failure report] at org.gradle.execution.plan.CompositeNodeGroup.isCanCancel(CompositeNodeGroup.java:101)
[05:43:04][Gradle failure report] at org.gradle.execution.plan.Node.isCanCancel(Node.java:232)
[05:43:04][Gradle failure report] at org.gradle.execution.plan.FinalizerGroup.isCanCancel(FinalizerGroup.java:155)
[05:43:04][Gradle failure report] at org.gradle.execution.plan.CompositeNodeGroup.isCanCancel(CompositeNodeGroup.java:101)
[05:43:04][Gradle failure report] at org.gradle.execution.plan.Node.isCanCancel(Node.java:232)
[05:43:04][Gradle failure report] at org.gradle.execution.plan.FinalizerGroup.isCanCancel(FinalizerGroup.java:155)
[05:43:04][Gradle failure report] at org.gradle.execution.plan.CompositeNodeGroup.isCanCancel(CompositeNodeGroup.java:101)
[05:43:04][Gradle failure report] at org.gradle.execution.plan.Node.isCanCancel(Node.java:232)
[05:43:04][Gradle failure report] at org.gradle.execution.plan.FinalizerGroup.isCanCancel(FinalizerGroup.java:155)
[05:43:04][Gradle failure report] at org.gradle.execution.plan.CompositeNodeGroup.isCanCancel(CompositeNodeGroup.java:101)
[05:43:04][Gradle failure report] at org.gradle.execution.plan.Node.isCanCancel(Node.java:232)
[05:43:04][Gradle failure report] at org.gradle.execution.plan.FinalizerGroup.isCanCancel(FinalizerGroup.java:155)
[05:43:04][Gradle failure report] at org.gradle.execution.plan.CompositeNodeGroup.isCanCancel(CompositeNodeGroup.java:101)
[05:43:04][Gradle failure report] at org.gradle.execution.plan.Node.isCanCancel(Node.java:232)
[05:43:04][Gradle failure report] at org.gradle.execution.plan.FinalizerGroup.isCanCancel(FinalizerGroup.java:155)
[05:43:04][Gradle failure report] at org.gradle.execution.plan.CompositeNodeGroup.isCanCancel(CompositeNodeGroup.java:101)
[05:43:04][Gradle failure report] at org.gradle.execution.plan.Node.isCanCancel(Node.java:232)
[05:43:04][Gradle failure report] at org.gradle.execution.plan.FinalizerGroup.isCanCancel(FinalizerGroup.java:155)
[05:43:04][Gradle failure report] at org.gradle.execution.plan.CompositeNodeGroup.isCanCancel(CompositeNodeGroup.java:101)
[05:43:04][Gradle failure report] at org.gradle.execution.plan.Node.isCanCancel(Node.java:232)
[05:43:04][Gradle failure report] at org.gradle.execution.plan.FinalizerGroup.isCanCancel(FinalizerGroup.java:155)
[05:43:04][Gradle failure report] at org.gradle.execution.plan.CompositeNodeGroup.isCanCancel(CompositeNodeGroup.java:101)
[05:43:04][Gradle failure report] at org.gradle.execution.plan.Node.isCanCancel(Node.java:232)
[05:43:04][Gradle failure report] at org.gradle.execution.plan.FinalizerGroup.isCanCancel(FinalizerGroup.java:155)
[05:43:04][Gradle failure report] at org.gradle.execution.plan.CompositeNodeGroup.isCanCancel(CompositeNodeGroup.java:101)
[05:43:04][Gradle failure report] at org.gradle.execution.plan.Node.isCanCancel(Node.java:232)
[05:43:04][Gradle failure report] at org.gradle.execution.plan.FinalizerGroup.isCanCancel(FinalizerGroup.java:155)
[05:43:04][Gradle failure report] at org.gradle.execution.plan.CompositeNodeGroup.isCanCancel(CompositeNodeGroup.java:101)
[05:43:04][Gradle failure report] at org.gradle.execution.plan.Node.isCanCancel(Node.java:232)
[05:43:04][Gradle failure report] at org.gradle.execution.plan.FinalizerGroup.isCanCancel(FinalizerGroup.java:155)
[05:43:04][Gradle failure report] at org.gradle.execution.plan.CompositeNodeGroup.isCanCancel(CompositeNodeGroup.java:101)
[05:43:04][Gradle failure report] at org.gradle.execution.plan.Node.isCanCancel(Node.java:232)
[05:43:04][Gradle failure report] at org.gradle.execution.plan.FinalizerGroup.isCanCancel(FinalizerGroup.java:155)
[05:43:04][Gradle failure report] at org.gradle.execution.plan.CompositeNodeGroup.isCanCancel(CompositeNodeGroup.java:101)
[05:43:04][Gradle failure report] at org.gradle.execution.plan.Node.isCanCancel(Node.java:232)
[05:43:04][Gradle failure report] at org.gradle.execution.plan.FinalizerGroup.isCanCancel(FinalizerGroup.java:155)
[05:43:04][Gradle failure report] at org.gradle.execution.plan.CompositeNodeGroup.isCanCancel(CompositeNodeGroup.java:101)
[05:43:04][Gradle failure report] at org.gradle.execution.plan.Node.isCanCancel(Node.java:232)
[05:43:04][Gradle failure report] at org.gradle.execution.plan.FinalizerGroup.isCanCancel(FinalizerGroup.java:155)
[05:43:04][Gradle failure report] at org.gradle.execution.plan.CompositeNodeGroup.isCanCancel(CompositeNodeGroup.java:101)
[05:43:04][Gradle failure report] at org.gradle.execution.plan.Node.isCanCancel(Node.java:232)
[05:43:04][Gradle failure report] at org.gradle.execution.plan.FinalizerGroup.isCanCancel(FinalizerGroup.java:155)
[05:43:04][Gradle failure report] at org.gradle.execution.plan.CompositeNodeGroup.isCanCancel(CompositeNodeGroup.java:101)
[05:43:04][Gradle failure report] at org.gradle.execution.plan.Node.isCanCancel(Node.java:232)
[05:43:04][Gradle failure report] at org.gradle.execution.plan.FinalizerGroup.isCanCancel(FinalizerGroup.java:155)
[05:43:04][Gradle failure report] at org.gradle.execution.plan.CompositeNodeGroup.isCanCancel(CompositeNodeGroup.java:101)
[05:43:04][Gradle failure report] at org.gradle.execution.plan.Node.isCanCancel(Node.java:232)
[05:43:04][Gradle failure report] at org.gradle.execution.plan.FinalizerGroup.isCanCancel(FinalizerGroup.java:155)
[05:43:04][Gradle failure report] at org.gradle.execution.plan.CompositeNodeGroup.isCanCancel(CompositeNodeGroup.java:101)
[05:43:04][Gradle failure report] at org.gradle.execution.plan.Node.isCanCancel(Node.java:232)
[05:43:04][Gradle failure report] at org.gradle.execution.plan.FinalizerGroup.isCanCancel(FinalizerGroup.java:155)
[05:43:04][Gradle failure report] at org.gradle.execution.plan.CompositeNodeGroup.isCanCancel(CompositeNodeGroup.java:101)
[05:43:04][Gradle failure report] at org.gradle.execution.plan.Node.isCanCancel(Node.java:232)
[05:43:04][Gradle failure report] at org.gradle.execution.plan.FinalizerGroup.isCanCancel(FinalizerGroup.java:155)
[05:43:04][Gradle failure report] at org.gradle.execution.plan.CompositeNodeGroup.isCanCancel(CompositeNodeGroup.java:101)
[05:43:04][Gradle failure report] at org.gradle.execution.plan.Node.isCanCancel(Node.java:232)
[05:43:04][Gradle failure report] at org.gradle.execution.plan.FinalizerGroup.isCanCancel(FinalizerGroup.java:155)
[05:43:04][Gradle failure report] at org.gradle.execution.plan.CompositeNodeGroup.isCanCancel(CompositeNodeGroup.java:101)
[05:43:04][Gradle failure report] at org.gradle.execution.plan.Node.isCanCancel(Node.java:232)
[05:43:04][Gradle failure report] at org.gradle.execution.plan.FinalizerGroup.isCanCancel(FinalizerGroup.java:155)
[05:43:04][Gradle failure report] at org.gradle.execution.plan.CompositeNodeGroup.isCanCancel(CompositeNodeGroup.java:101)
[05:43:04][Gradle failure report] at org.gradle.execution.plan.Node.isCanCancel(Node.java:232)
[05:43:04][Gradle failure report] at org.gradle.execution.plan.FinalizerGroup.isCanCancel(FinalizerGroup.java:155)
[05:43:04][Gradle failure report] at org.gradle.execution.plan.CompositeNodeGroup.isCanCancel(CompositeNodeGroup.java:101)
[05:43:04][Gradle failure report] at org.gradle.execution.plan.Node.isCanCancel(Node.java:232)
[05:43:04][Gradle failure report] at org.gradle.execution.plan.FinalizerGroup.isCanCancel(FinalizerGroup.java:155)
[05:43:04][Gradle failure report] at org.gradle.execution.plan.CompositeNodeGroup.isCanCancel(CompositeNodeGroup.java:101)
[05:43:04][Gradle failure report] at org.gradle.execution.plan.Node.isCanCancel(Node.java:232)
[05:43:04][Gradle failure report] at org.gradle.execution.plan.FinalizerGroup.isCanCancel(FinalizerGroup.java:155)
[05:43:04][Gradle failure report] at org.gradle.execution.plan.CompositeNodeGroup.isCanCancel(CompositeNodeGroup.java:101)
[05:43:04][Gradle failure report] at org.gradle.execution.plan.Node.isCanCancel(Node.java:232)
[05:43:04][Gradle failure report] at org.gradle.execution.plan.FinalizerGroup.isCanCancel(FinalizerGroup.java:155)
[05:43:04][Gradle failure report] at org.gradle.execution.plan.CompositeNodeGroup.isCanCancel(CompositeNodeGroup.java:101)
[05:43:04][Gradle failure report] at org.gradle.execution.plan.Node.isCanCancel(Node.java:232)
[05:43:04][Gradle failure report] at org.gradle.execution.plan.FinalizerGroup.isCanCancel(FinalizerGroup.java:155)
[05:43:04][Gradle failure report] at org.gradle.execution.plan.CompositeNodeGroup.isCanCancel(CompositeNodeGroup.java:101)
[05:43:04][Gradle failure report] at org.gradle.execution.plan.Node.isCanCancel(Node.java:232)
[05:43:04][Gradle failure report] at org.gradle.execution.plan.FinalizerGroup.isCanCancel(FinalizerGroup.java:155)
[05:43:04][Gradle failure report] at org.gradle.execution.plan.CompositeNodeGroup.isCanCancel(CompositeNodeGroup.java:101)
[05:43:04][Gradle failure report] at org.gradle.execution.plan.Node.isCanCancel(Node.java:232)
[05:43:04][Gradle failure report] at org.gradle.execution.plan.FinalizerGroup.isCanCancel(FinalizerGroup.java:155)
[05:43:04][Gradle failure report] at org.gradle.execution.plan.CompositeNodeGroup.isCanCancel(CompositeNodeGroup.java:101)
[05:43:04][Gradle failure report] at org.gradle.execution.plan.Node.isCanCancel(Node.java:232)
[05:43:04][Gradle failure report] at org.gradle.execution.plan.FinalizerGroup.isCanCancel(FinalizerGroup.java:155)
[05:43:04][Gradle failure report] at org.gradle.execution.plan.CompositeNodeGroup.isCanCancel(CompositeNodeGroup.java:101)
[05:43:04][Gradle failure report] at org.gradle.execution.plan.Node.isCanCancel(Node.java:232)
[05:43:04][Gradle failure report] at org.gradle.execution.plan.FinalizerGroup.isCanCancel(FinalizerGroup.java:155)
[05:43:04][Gradle failure report] at org.gradle.execution.plan.CompositeNodeGroup.isCanCancel(CompositeNodeGroup.java:101)
[05:43:04][Gradle failure report] at org.gradle.execution.plan.Node.isCanCancel(Node.java:232)
[05:43:04][Gradle failure report] at org.gradle.execution.plan.FinalizerGroup.isCanCancel(FinalizerGroup.java:155)
[05:43:04][Gradle failure report] at org.gradle.execution.plan.CompositeNodeGroup.isCanCancel(CompositeNodeGroup.java:101)
[05:43:04][Gradle failure report] at org.gradle.execution.plan.Node.isCanCancel(Node.java:232)
[05:43:04][Gradle failure report] at org.gradle.execution.plan.FinalizerGroup.isCanCancel(FinalizerGroup.java:155)
[05:43:04][Gradle failure report] at org.gradle.execution.plan.CompositeNodeGroup.isCanCancel(CompositeNodeGroup.java:101)
[05:43:04][Gradle failure report] at org.gradle.execution.plan.Node.isCanCancel(Node.java:232)
[05:43:04][Gradle failure report] at org.gradle.execution.plan.FinalizerGroup.isCanCancel(FinalizerGroup.java:155)
[05:43:04][Gradle failure report] at org.gradle.execution.plan.CompositeNodeGroup.isCanCancel(CompositeNodeGroup.java:101)
[05:43:04][Gradle failure report] at org.gradle.execution.plan.Node.isCanCancel(Node.java:232)
[05:43:04][Gradle failure report] at org.gradle.execution.plan.FinalizerGroup.isCanCancel(FinalizerGroup.java:155)
[05:43:04][Gradle failure report] at org.gradle.execution.plan.CompositeNodeGroup.isCanCancel(CompositeNodeGroup.java:101)
[05:43:04][Gradle failure report] at org.gradle.execution.plan.Node.isCanCancel(Node.java:232)
[05:43:04][Gradle failure report] at org.gradle.execution.plan.FinalizerGroup.isCanCancel(FinalizerGroup.java:155)
[05:43:04][Gradle failure report] at org.gradle.execution.plan.CompositeNodeGroup.isCanCancel(CompositeNodeGroup.java:101)
[05:43:04][Gradle failure report] at org.gradle.execution.plan.Node.isCanCancel(Node.java:232)
[05:43:04][Gradle failure report] at org.gradle.execution.plan.FinalizerGroup.isCanCancel(FinalizerGroup.java:155)
[05:43:04][Gradle failure report] at org.gradle.execution.plan.CompositeNodeGroup.isCanCancel(CompositeNodeGroup.java:101)
[05:43:04][Gradle failure report] at org.gradle.execution.plan.Node.isCanCancel(Node.java:232)
[05:43:04][Gradle failure report] at org.gradle.execution.plan.FinalizerGroup.isCanCancel(FinalizerGroup.java:155)
[05:43:04][Gradle failure report] at org.gradle.execution.plan.CompositeNodeGroup.isCanCancel(CompositeNodeGroup.java:101)
[05:43:04][Gradle failure report] at org.gradle.execution.plan.Node.isCanCancel(Node.java:232)
[05:43:04][Gradle failure report] at org.gradle.execution.plan.FinalizerGroup.isCanCancel(FinalizerGroup.java:155)
[05:43:04][Gradle failure report] at org.gradle.execution.plan.CompositeNodeGroup.isCanCancel(CompositeNodeGroup.java:101)
[05:43:04][Gradle failure report] at org.gradle.execution.plan.Node.isCanCancel(Node.java:232)
[05:43:04][Gradle failure report] at org.gradle.execution.plan.FinalizerGroup.isCanCancel(FinalizerGroup.java:155)
[05:43:04][Gradle failure report] at org.gradle.execution.plan.CompositeNodeGroup.isCanCancel(CompositeNodeGroup.java:101)
[05:43:04][Gradle failure report] at org.gradle.execution.plan.Node.isCanCancel(Node.java:232)
[05:43:04][Gradle failure report] at org.gradle.execution.plan.FinalizerGroup.isCanCancel(FinalizerGroup.java:155)
[05:43:04][Gradle failure report] at org.gradle.execution.plan.CompositeNodeGroup.isCanCancel(CompositeNodeGroup.java:101)
[05:43:04][Gradle failure report] at org.gradle.execution.plan.Node.isCanCancel(Node.java:232)
[05:43:04][Gradle failure report] at org.gradle.execution.plan.FinalizerGroup.isCanCancel(FinalizerGroup.java:155)
[05:43:04][Gradle failure report] at org.gradle.execution.plan.CompositeNodeGroup.isCanCancel(CompositeNodeGroup.java:101)
[05:43:04][Gradle failure report] at org.gradle.execution.plan.Node.isCanCancel(Node.java:232)
[05:43:04][Gradle failure report] at org.gradle.execution.plan.FinalizerGroup.isCanCancel(FinalizerGroup.java:155)
[05:43:04][Gradle failure report] at org.gradle.execution.plan.CompositeNodeGroup.isCanCancel(CompositeNodeGroup.java:101)
[05:43:04][Gradle failure report] at org.gradle.execution.plan.Node.isCanCancel(Node.java:232)
[05:43:04][Gradle failure report] at org.gradle.execution.plan.FinalizerGroup.isCanCancel(FinalizerGroup.java:155)
[05:43:04][Gradle failure report] at org.gradle.execution.plan.CompositeNodeGroup.isCanCancel(CompositeNodeGroup.java:101)
[05:43:04][Gradle failure report] at org.gradle.execution.plan.Node.isCanCancel(Node.java:232)
[05:43:04][Gradle failure report] at org.gradle.execution.plan.FinalizerGroup.isCanCancel(FinalizerGroup.java:155)
[05:43:04][Gradle failure report] at org.gradle.execution.plan.CompositeNodeGroup.isCanCancel(CompositeNodeGroup.java:101)
[05:43:04][Gradle failure report] at org.gradle.execution.plan.Node.isCanCancel(Node.java:232)
[05:43:04][Gradle failure report] at org.gradle.execution.plan.FinalizerGroup.isCanCancel(FinalizerGroup.java:155)
[05:43:04][Gradle failure report] at org.gradle.execution.plan.CompositeNodeGroup.isCanCancel(CompositeNodeGroup.java:101)
[05:43:04][Gradle failure report] at org.gradle.execution.plan.Node.isCanCancel(Node.java:232)
[05:43:04][Gradle failure report] at org.gradle.execution.plan.FinalizerGroup.isCanCancel(FinalizerGroup.java:155)
[05:43:04][Gradle failure report] at org.gradle.execution.plan.CompositeNodeGroup.isCanCancel(CompositeNodeGroup.java:101)
[05:43:04][Gradle failure report] at org.gradle.execution.plan.Node.isCanCancel(Node.java:232)
[05:43:04][Gradle failure report] at org.gradle.execution.plan.FinalizerGroup.isCanCancel(FinalizerGroup.java:155)
[05:43:04][Gradle failure report] at org.gradle.execution.plan.CompositeNodeGroup.isCanCancel(CompositeNodeGroup.java:101)
[05:43:04][Gradle failure report] at org.gradle.execution.plan.Node.isCanCancel(Node.java:232)
[05:43:04][Gradle failure report] at org.gradle.execution.plan.FinalizerGroup.isCanCancel(FinalizerGroup.java:155)
[05:43:04][Gradle failure report] at org.gradle.execution.plan.CompositeNodeGroup.isCanCancel(CompositeNodeGroup.java:101)
[05:43:04][Gradle failure report] at org.gradle.execution.plan.Node.isCanCancel(Node.java:232)
[05:43:04][Gradle failure report] at org.gradle.execution.plan.FinalizerGroup.isCanCancel(FinalizerGroup.java:155)
[05:43:04][Gradle failure report] at org.gradle.execution.plan.CompositeNodeGroup.isCanCancel(CompositeNodeGroup.java:101)
[05:43:04][Gradle failure report] at org.gradle.execution.plan.Node.isCanCancel(Node.java:232)
[05:43:04][Gradle failure report] at org.gradle.execution.plan.FinalizerGroup.isCanCancel(FinalizerGroup.java:155)
[05:43:04][Gradle failure report] at org.gradle.execution.plan.CompositeNodeGroup.isCanCancel(CompositeNodeGroup.java:101)
[05:43:04][Gradle failure report] at org.gradle.execution.plan.Node.isCanCancel(Node.java:232)
[05:43:04][Gradle failure report] at org.gradle.execution.plan.FinalizerGroup.isCanCancel(FinalizerGroup.java:155)
[05:43:04][Gradle failure report] at org.gradle.execution.plan.CompositeNodeGroup.isCanCancel(CompositeNodeGroup.java:101)
[05:43:04][Gradle failure report] at org.gradle.execution.plan.Node.isCanCancel(Node.java:232)
[05:43:04][Gradle failure report] at org.gradle.execution.plan.FinalizerGroup.isCanCancel(FinalizerGroup.java:155)
[05:43:04][Gradle failure report] at org.gradle.execution.plan.CompositeNodeGroup.isCanCancel(CompositeNodeGroup.java:101)
[05:43:04][Gradle failure report] at org.gradle.execution.plan.Node.isCanCancel(Node.java:232)
[05:43:04][Gradle failure report] at org.gradle.execution.plan.FinalizerGroup.isCanCancel(FinalizerGroup.java:155)
[05:43:04][Gradle failure report] at org.gradle.execution.plan.CompositeNodeGroup.isCanCancel(CompositeNodeGroup.java:101)
[05:43:04][Gradle failure report] at org.gradle.execution.plan.Node.isCanCancel(Node.java:232)
[05:43:04][Gradle failure report] at org.gradle.execution.plan.FinalizerGroup.isCanCancel(FinalizerGroup.java:155)
[05:43:04][Gradle failure report] at org.gradle.execution.plan.CompositeNodeGroup.isCanCancel(CompositeNodeGroup.java:101)
[05:43:04][Gradle failure report] at org.gradle.execution.plan.Node.isCanCancel(Node.java:232)
[05:43:04][Gradle failure report] at org.gradle.execution.plan.FinalizerGroup.isCanCancel(FinalizerGroup.java:155)
[05:43:04][Gradle failure report] at org.gradle.execution.plan.CompositeNodeGroup.isCanCancel(CompositeNodeGroup.java:101)
[05:43:04][Gradle failure report] at org.gradle.execution.plan.Node.isCanCancel(Node.java:232)
[05:43:04][Gradle failure report] at org.gradle.execution.plan.FinalizerGroup.isCanCancel(FinalizerGroup.java:155)
[05:43:04][Gradle failure report] at org.gradle.execution.plan.CompositeNodeGroup.isCanCancel(CompositeNodeGroup.java:101)
[05:43:04][Gradle failure report] at org.gradle.execution.plan.Node.isCanCancel(Node.java:232)
[05:43:04][Gradle failure report] at org.gradle.execution.plan.FinalizerGroup.isCanCancel(FinalizerGroup.java:155)
[05:43:04][Gradle failure report] at org.gradle.execution.plan.CompositeNodeGroup.isCanCancel(CompositeNodeGroup.java:101)
[05:43:04][Gradle failure report] at org.gradle.execution.plan.Node.isCanCancel(Node.java:232)
[05:43:04][Gradle failure report] at org.gradle.execution.plan.FinalizerGroup.isCanCancel(FinalizerGroup.java:155)
[05:43:04][Gradle failure report] at org.gradle.execution.plan.CompositeNodeGroup.isCanCancel(CompositeNodeGroup.java:101)
[05:43:04][Gradle failure report] at org.gradle.execution.plan.Node.isCanCancel(Node.java:232)
[05:43:04][Gradle failure report] at org.gradle.execution.plan.FinalizerGroup.isCanCancel(FinalizerGroup.java:155)
[05:43:04][Gradle failure report] at org.gradle.execution.plan.CompositeNodeGroup.isCanCancel(CompositeNodeGroup.java:101)
[05:43:04][Gradle failure report] at org.gradle.execution.plan.Node.isCanCancel(Node.java:232)
[05:43:04][Gradle failure report] at org.gradle.execution.plan.FinalizerGroup.isCanCancel(FinalizerGroup.java:155)
[05:43:04][Gradle failure report] at org.gradle.execution.plan.CompositeNodeGroup.isCanCancel(CompositeNodeGroup.java:101)
[05:43:04][Gradle failure report] at org.gradle.execution.plan.Node.isCanCancel(Node.java:232)
[05:43:04][Gradle failure report] at org.gradle.execution.plan.FinalizerGroup.isCanCancel(FinalizerGroup.java:155)
[05:43:04][Gradle failure report] at org.gradle.execution.plan.CompositeNodeGroup.isCanCancel(CompositeNodeGroup.java:101)
[05:43:04][Gradle failure report] at org.gradle.execution.plan.Node.isCanCancel(Node.java:232)
[05:43:04][Gradle failure report] at org.gradle.execution.plan.FinalizerGroup.isCanCancel(FinalizerGroup.java:155)
[05:43:04][Gradle failure report] at org.gradle.execution.plan.CompositeNodeGroup.isCanCancel(CompositeNodeGroup.java:101)
[05:43:04][Gradle failure report] at org.gradle.execution.plan.Node.isCanCancel(Node.java:232)
[05:43:04][Gradle failure report] at org.gradle.execution.plan.FinalizerGroup.isCanCancel(FinalizerGroup.java:155)
[05:43:04][Gradle failure report] at org.gradle.execution.plan.CompositeNodeGroup.isCanCancel(CompositeNodeGroup.java:101)
[05:43:04][Gradle failure report] at org.gradle.execution.plan.Node.isCanCancel(Node.java:232)
[05:43:04][Gradle failure report] at org.gradle.execution.plan.FinalizerGroup.isCanCancel(FinalizerGroup.java:155)
[05:43:04][Gradle failure report] at org.gradle.execution.plan.CompositeNodeGroup.isCanCancel(CompositeNodeGroup.java:101)
[05:43:04][Gradle failure report] at org.gradle.execution.plan.Node.isCanCancel(Node.java:232)
[05:43:04][Gradle failure report] at org.gradle.execution.plan.FinalizerGroup.isCanCancel(FinalizerGroup.java:155)
[05:43:04][Gradle failure report] at org.gradle.execution.plan.CompositeNodeGroup.isCanCancel(CompositeNodeGroup.java:101)
[05:43:04][Gradle failure report] at org.gradle.execution.plan.Node.isCanCancel(Node.java:232)
[05:43:04][Gradle failure report] at org.gradle.execution.plan.FinalizerGroup.isCanCancel(FinalizerGroup.java:155)
[05:43:04][Gradle failure report] at org.gradle.execution.plan.CompositeNodeGroup.isCanCancel(CompositeNodeGroup.java:101)
[05:43:04][Gradle failure report] at org.gradle.execution.plan.Node.isCanCancel(Node.java:232)
[05:43:04][Gradle failure report] at org.gradle.execution.plan.FinalizerGroup.isCanCancel(FinalizerGroup.java:155)
[05:43:04][Gradle failure report] at org.gradle.execution.plan.CompositeNodeGroup.isCanCancel(CompositeNodeGroup.java:101)
[05:43:04][Gradle failure report] at org.gradle.execution.plan.Node.isCanCancel(Node.java:232)
[05:43:04][Gradle failure report] at org.gradle.execution.plan.FinalizerGroup.isCanCancel(FinalizerGroup.java:155)
[05:43:04][Gradle failure report] at org.gradle.execution.plan.CompositeNodeGroup.isCanCancel(CompositeNodeGroup.java:101)
[05:43:04][Gradle failure report] at org.gradle.execution.plan.Node.isCanCancel(Node.java:232)
[05:43:04][Gradle failure report] at org.gradle.execution.plan.FinalizerGroup.isCanCancel(FinalizerGroup.java:155)
[05:43:04][Gradle failure report] at org.gradle.execution.plan.CompositeNodeGroup.isCanCancel(CompositeNodeGroup.java:101)
[05:43:04][Gradle failure report] at org.gradle.execution.plan.Node.isCanCancel(Node.java:232)
[05:43:04][Gradle failure report] at org.gradle.execution.plan.FinalizerGroup.isCanCancel(FinalizerGroup.java:155)
[05:43:04][Gradle failure report] at org.gradle.execution.plan.CompositeNodeGroup.isCanCancel(CompositeNodeGroup.java:101)
[05:43:04][Gradle failure report] at org.gradle.execution.plan.Node.isCanCancel(Node.java:232)
[05:43:04][Gradle failure report] at org.gradle.execution.plan.FinalizerGroup.isCanCancel(FinalizerGroup.java:155)
[05:43:04][Gradle failure report] at org.gradle.execution.plan.CompositeNodeGroup.isCanCancel(CompositeNodeGroup.java:101)
[05:43:04][Gradle failure report] at org.gradle.execution.plan.Node.isCanCancel(Node.java:232)
[05:43:04][Gradle failure report] at org.gradle.execution.plan.FinalizerGroup.isCanCancel(FinalizerGroup.java:155)
[05:43:04][Gradle failure report] at org.gradle.execution.plan.CompositeNodeGroup.isCanCancel(CompositeNodeGroup.java:101)
[05:43:04][Gradle failure report] at org.gradle.execution.plan.Node.isCanCancel(Node.java:232)
[05:43:04][Gradle failure report] at org.gradle.execution.plan.FinalizerGroup.isCanCancel(FinalizerGroup.java:155)
[05:43:04][Gradle failure report] at org.gradle.execution.plan.CompositeNodeGroup.isCanCancel(CompositeNodeGroup.java:101)
[05:43:04][Gradle failure report] at org.gradle.execution.plan.Node.isCanCancel(Node.java:232)
[05:43:04][Gradle failure report] at org.gradle.execution.plan.FinalizerGroup.isCanCancel(FinalizerGroup.java:155)
[05:43:04][Gradle failure report] at org.gradle.execution.plan.CompositeNodeGroup.isCanCancel(CompositeNodeGroup.java:101)
[05:43:04][Gradle failure report] at org.gradle.execution.plan.Node.isCanCancel(Node.java:232)
[05:43:04][Gradle failure report] at org.gradle.execution.plan.FinalizerGroup.isCanCancel(FinalizerGroup.java:155)
[05:43:04][Gradle failure report] at org.gradle.execution.plan.CompositeNodeGroup.isCanCancel(CompositeNodeGroup.java:101)
[05:43:04][Gradle failure report] at org.gradle.execution.plan.Node.isCanCancel(Node.java:232)
[05:43:04][Gradle failure report] at org.gradle.execution.plan.FinalizerGroup.isCanCancel(FinalizerGroup.java:155)
[05:43:04][Gradle failure report] at org.gradle.execution.plan.CompositeNodeGroup.isCanCancel(CompositeNodeGroup.java:101)
[05:43:04][Gradle failure report] at org.gradle.execution.plan.Node.isCanCancel(Node.java:232)
[05:43:04][Gradle failure report] at org.gradle.execution.plan.FinalizerGroup.isCanCancel(FinalizerGroup.java:155)
[05:43:04][Gradle failure report] at org.gradle.execution.plan.CompositeNodeGroup.isCanCancel(CompositeNodeGroup.java:101)
[05:43:04][Gradle failure report] at org.gradle.execution.plan.Node.isCanCancel(Node.java:232)
[05:43:04][Gradle failure report] at org.gradle.execution.plan.FinalizerGroup.isCanCancel(FinalizerGroup.java:155)
[05:43:04][Gradle failure report] at org.gradle.execution.plan.CompositeNodeGroup.isCanCancel(CompositeNodeGroup.java:101)
[05:43:04][Gradle failure report] at org.gradle.execution.plan.Node.isCanCancel(Node.java:232)
[05:43:04][Gradle failure report] at org.gradle.execution.plan.FinalizerGroup.isCanCancel(FinalizerGroup.java:155)
[05:43:04][Gradle failure report] at org.gradle.execution.plan.CompositeNodeGroup.isCanCancel(CompositeNodeGroup.java:101)
[05:43:04][Gradle failure report] at org.gradle.execution.plan.Node.isCanCancel(Node.java:232)
[05:43:04][Gradle failure report] at org.gradle.execution.plan.FinalizerGroup.isCanCancel(FinalizerGroup.java:155)
[05:43:04][Gradle failure report] at org.gradle.execution.plan.CompositeNodeGroup.isCanCancel(CompositeNodeGroup.java:101)
[05:43:04][Gradle failure report] at org.gradle.execution.plan.Node.isCanCancel(Node.java:232)
[05:43:04][Gradle failure report] at org.gradle.execution.plan.FinalizerGroup.isCanCancel(FinalizerGroup.java:155)
[05:43:04][Gradle failure report] at org.gradle.execution.plan.CompositeNodeGroup.isCanCancel(CompositeNodeGroup.java:101)
[05:43:04][Gradle failure report] at org.gradle.execution.plan.Node.isCanCancel(Node.java:232)
[05:43:04][Gradle failure report] at org.gradle.execution.plan.FinalizerGroup.isCanCancel(FinalizerGroup.java:155)
[05:43:04][Gradle failure report] at org.gradle.execution.plan.CompositeNodeGroup.isCanCancel(CompositeNodeGroup.java:101)
[05:43:04][Gradle failure report] at org.gradle.execution.plan.Node.isCanCancel(Node.java:232)
[05:43:04][Gradle failure report] at org.gradle.execution.plan.FinalizerGroup.isCanCancel(FinalizerGroup.java:155)
[05:43:04][Gradle failure report] at org.gradle.execution.plan.CompositeNodeGroup.isCanCancel(CompositeNodeGroup.java:101)
[05:43:04][Gradle failure report] at org.gradle.execution.plan.Node.isCanCancel(Node.java:232)
[05:43:04][Gradle failure report] at org.gradle.execution.plan.FinalizerGroup.isCanCancel(FinalizerGroup.java:155)
[05:43:04][Gradle failure report] at org.gradle.execution.plan.CompositeNodeGroup.isCanCancel(CompositeNodeGroup.java:101)
[05:43:04][Gradle failure report] at org.gradle.execution.plan.Node.isCanCancel(Node.java:232)
[05:43:04][Gradle failure report] at org.gradle.execution.plan.FinalizerGroup.isCanCancel(FinalizerGroup.java:155)
[05:43:04][Gradle failure report] at org.gradle.execution.plan.CompositeNodeGroup.isCanCancel(CompositeNodeGroup.java:101)
[05:43:04][Gradle failure report] at org.gradle.execution.plan.Node.isCanCancel(Node.java:232)
[05:43:04][Gradle failure report] at org.gradle.execution.plan.FinalizerGroup.isCanCancel(FinalizerGroup.java:155)
[05:43:04][Gradle failure report] at org.gradle.execution.plan.CompositeNodeGroup.isCanCancel(CompositeNodeGroup.java:101)
[05:43:04][Gradle failure report] at org.gradle.execution.plan.Node.isCanCancel(Node.java:232)
[05:43:04][Gradle failure report] at org.gradle.execution.plan.FinalizerGroup.isCanCancel(FinalizerGroup.java:155)
[05:43:04][Gradle failure report] at org.gradle.execution.plan.CompositeNodeGroup.isCanCancel(CompositeNodeGroup.java:101)
[05:43:04][Gradle failure report] at org.gradle.execution.plan.Node.isCanCancel(Node.java:232)
[05:43:04][Gradle failure report] at org.gradle.execution.plan.FinalizerGroup.isCanCancel(FinalizerGroup.java:155)
[05:43:04][Gradle failure report] at org.gradle.execution.plan.CompositeNodeGroup.isCanCancel(CompositeNodeGroup.java:101)
[05:43:04][Gradle failure report] at org.gradle.execution.plan.Node.isCanCancel(Node.java:232)
[05:43:04][Gradle failure report] at org.gradle.execution.plan.FinalizerGroup.isCanCancel(FinalizerGroup.java:155)
[05:43:04][Gradle failure report] at org.gradle.execution.plan.CompositeNodeGroup.isCanCancel(CompositeNodeGroup.java:101)
[05:43:04][Gradle failure report] at org.gradle.execution.plan.Node.isCanCancel(Node.java:232)
[05:43:04][Gradle failure report] at org.gradle.execution.plan.FinalizerGroup.isCanCancel(FinalizerGroup.java:155)
[05:43:04][Gradle failure report] at org.gradle.execution.plan.CompositeNodeGroup.isCanCancel(CompositeNodeGroup.java:101)
[05:43:04][Gradle failure report] at org.gradle.execution.plan.Node.isCanCancel(Node.java:232)
[05:43:04][Gradle failure report] at org.gradle.execution.plan.FinalizerGroup.isCanCancel(FinalizerGroup.java:155)
[05:43:04][Gradle failure report] at org.gradle.execution.plan.CompositeNodeGroup.isCanCancel(CompositeNodeGroup.java:101)
[05:43:04][Gradle failure report] at org.gradle.execution.plan.Node.isCanCancel(Node.java:232)
[05:43:04][Gradle failure report] at org.gradle.execution.plan.FinalizerGroup.isCanCancel(FinalizerGroup.java:155)
[05:43:04][Gradle failure report] at org.gradle.execution.plan.CompositeNodeGroup.isCanCancel(CompositeNodeGroup.java:101)
[05:43:04][Gradle failure report] at org.gradle.execution.plan.Node.isCanCancel(Node.java:232)
[05:43:04][Gradle failure report] at org.gradle.execution.plan.FinalizerGroup.isCanCancel(FinalizerGroup.java:155)
[05:43:04][Gradle failure report] at org.gradle.execution.plan.CompositeNodeGroup.isCanCancel(CompositeNodeGroup.java:101)
[05:43:04][Gradle failure report] at org.gradle.execution.plan.Node.isCanCancel(Node.java:232)
[05:43:04][Gradle failure report] at org.gradle.execution.plan.FinalizerGroup.isCanCancel(FinalizerGroup.java:155)
[05:43:04][Gradle failure report] at org.gradle.execution.plan.CompositeNodeGroup.isCanCancel(CompositeNodeGroup.java:101)
[05:43:04][Gradle failure report] at org.gradle.execution.plan.Node.isCanCancel(Node.java:232)
[05:43:04][Gradle failure report] at org.gradle.execution.plan.FinalizerGroup.isCanCancel(FinalizerGroup.java:155)
[05:43:04][Gradle failure report] at org.gradle.execution.plan.CompositeNodeGroup.isCanCancel(CompositeNodeGroup.java:101)
[05:43:04][Gradle failure report] at org.gradle.execution.plan.Node.isCanCancel(Node.java:232)
[05:43:04][Gradle failure report] at org.gradle.execution.plan.FinalizerGroup.isCanCancel(FinalizerGroup.java:155)
[05:43:04][Gradle failure report] at org.gradle.execution.plan.CompositeNodeGroup.isCanCancel(CompositeNodeGroup.java:101)
[05:43:04][Gradle failure report] at org.gradle.execution.plan.Node.isCanCancel(Node.java:232)
[05:43:04][Gradle failure report] at org.gradle.execution.plan.FinalizerGroup.isCanCancel(FinalizerGroup.java:155)
[05:43:04][Gradle failure report] at org.gradle.execution.plan.CompositeNodeGroup.isCanCancel(CompositeNodeGroup.java:101)
[05:43:04][Gradle failure report] at org.gradle.execution.plan.Node.isCanCancel(Node.java:232)
[05:43:04][Gradle failure report] at org.gradle.execution.plan.FinalizerGroup.isCanCancel(FinalizerGroup.java:155)
[05:43:04][Gradle failure report] at org.gradle.execution.plan.CompositeNodeGroup.isCanCancel(CompositeNodeGroup.java:101)
[05:43:04][Gradle failure report] at org.gradle.execution.plan.Node.isCanCancel(Node.java:232)
[05:43:04][Gradle failure report] at org.gradle.execution.plan.FinalizerGroup.isCanCancel(FinalizerGroup.java:155)
[05:43:04][Gradle failure report] at org.gradle.execution.plan.CompositeNodeGroup.isCanCancel(CompositeNodeGroup.java:101)
[05:43:04][Gradle failure report] at org.gradle.execution.plan.Node.isCanCancel(Node.java:232)
[05:43:04][Gradle failure report] at org.gradle.execution.plan.FinalizerGroup.isCanCancel(FinalizerGroup.java:155)
[05:43:04][Gradle failure report] at org.gradle.execution.plan.CompositeNodeGroup.isCanCancel(CompositeNodeGroup.java:101)
[05:43:04][Gradle failure report] at org.gradle.execution.plan.Node.isCanCancel(Node.java:232)
[05:43:04][Gradle failure report] at org.gradle.execution.plan.FinalizerGroup.isCanCancel(FinalizerGroup.java:155)
[05:43:04][Gradle failure report] at org.gradle.execution.plan.CompositeNodeGroup.isCanCancel(CompositeNodeGroup.java:101)
[05:43:04][Gradle failure report] at org.gradle.execution.plan.Node.isCanCancel(Node.java:232)
[05:43:04][Gradle failure report] at org.gradle.execution.plan.FinalizerGroup.isCanCancel(FinalizerGroup.java:155)
[05:43:04][Gradle failure report] at org.gradle.execution.plan.CompositeNodeGroup.isCanCancel(CompositeNodeGroup.java:101)
[05:43:04][Gradle failure report] at org.gradle.execution.plan.Node.isCanCancel(Node.java:232)
[05:43:04][Gradle failure report] at org.gradle.execution.plan.FinalizerGroup.isCanCancel(FinalizerGroup.java:155)
[05:43:04][Gradle failure report] at org.gradle.execution.plan.CompositeNodeGroup.isCanCancel(CompositeNodeGroup.java:101)
[05:43:04][Gradle failure report] at org.gradle.execution.plan.Node.isCanCancel(Node.java:232)
[05:43:04][Gradle failure report] at org.gradle.execution.plan.FinalizerGroup.isCanCancel(FinalizerGroup.java:155)
[05:43:04][Gradle failure report] at org.gradle.execution.plan.CompositeNodeGroup.isCanCancel(CompositeNodeGroup.java:101)
[05:43:04][Gradle failure report] at org.gradle.execution.plan.Node.isCanCancel(Node.java:232)
[05:43:04][Gradle failure report] at org.gradle.execution.plan.FinalizerGroup.isCanCancel(FinalizerGroup.java:155)
[05:43:04][Gradle failure report] at org.gradle.execution.plan.CompositeNodeGroup.isCanCancel(CompositeNodeGroup.java:101)
[05:43:04][Gradle failure report] at org.gradle.execution.plan.Node.isCanCancel(Node.java:232)
[05:43:04][Gradle failure report] at org.gradle.execution.plan.FinalizerGroup.isCanCancel(FinalizerGroup.java:155)
[05:43:04][Gradle failure report] at org.gradle.execution.plan.CompositeNodeGroup.isCanCancel(CompositeNodeGroup.java:101)
[05:43:04][Gradle failure report] at org.gradle.execution.plan.Node.isCanCancel(Node.java:232)
[05:43:04][Gradle failure report] at org.gradle.execution.plan.FinalizerGroup.isCanCancel(FinalizerGroup.java:155)
[05:43:04][Gradle failure report] at org.gradle.execution.plan.CompositeNodeGroup.isCanCancel(CompositeNodeGroup.java:101)
[05:43:04][Gradle failure report] at org.gradle.execution.plan.Node.isCanCancel(Node.java:232)
[05:43:04][Gradle failure report] at org.gradle.execution.plan.FinalizerGroup.isCanCancel(FinalizerGroup.java:155)
[05:43:04][Gradle failure report] at org.gradle.execution.plan.CompositeNodeGroup.isCanCancel(CompositeNodeGroup.java:101)
[05:43:04][Gradle failure report] at org.gradle.execution.plan.Node.isCanCancel(Node.java:232)
[05:43:04][Gradle failure report] at org.gradle.execution.plan.FinalizerGroup.isCanCancel(FinalizerGroup.java:155)
[05:43:04][Gradle failure report] at org.gradle.execution.plan.CompositeNodeGroup.isCanCancel(CompositeNodeGroup.java:101)
[05:43:04][Gradle failure report] at org.gradle.execution.plan.Node.isCanCancel(Node.java:232)
[05:43:04][Gradle failure report] at org.gradle.execution.plan.FinalizerGroup.isCanCancel(FinalizerGroup.java:155)
[05:43:04][Gradle failure report] at org.gradle.execution.plan.CompositeNodeGroup.isCanCancel(CompositeNodeGroup.java:101)
[05:43:04][Gradle failure report] at org.gradle.execution.plan.Node.isCanCancel(Node.java:232)
[05:43:04][Gradle failure report] at org.gradle.execution.plan.FinalizerGroup.isCanCancel(FinalizerGroup.java:155)
[05:43:04][Gradle failure report] at org.gradle.execution.plan.CompositeNodeGroup.isCanCancel(CompositeNodeGroup.java:101)
[05:43:04][Gradle failure report] at org.gradle.execution.plan.Node.isCanCancel(Node.java:232)
[05:43:04][Gradle failure report] at org.gradle.execution.plan.FinalizerGroup.isCanCancel(FinalizerGroup.java:155)
[05:43:04][Gradle failure report] at org.gradle.execution.plan.CompositeNodeGroup.isCanCancel(CompositeNodeGroup.java:101)
[05:43:04][Gradle failure report] at org.gradle.execution.plan.Node.isCanCancel(Node.java:232)
[05:43:04][Gradle failure report] at org.gradle.execution.plan.FinalizerGroup.isCanCancel(FinalizerGroup.java:155)
[05:43:04][Gradle failure report] at org.gradle.execution.plan.CompositeNodeGroup.isCanCancel(CompositeNodeGroup.java:101)
[05:43:04][Gradle failure report] at org.gradle.execution.plan.Node.isCanCancel(Node.java:232)
[05:43:04][Gradle failure report] at org.gradle.execution.plan.FinalizerGroup.isCanCancel(FinalizerGroup.java:155)
[05:43:04][Gradle failure report] at org.gradle.execution.plan.CompositeNodeGroup.isCanCancel(CompositeNodeGroup.java:101)
[05:43:04][Gradle failure report] at org.gradle.execution.plan.Node.isCanCancel(Node.java:232)
[05:43:04][Gradle failure report] at org.gradle.execution.plan.FinalizerGroup.isCanCancel(FinalizerGroup.java:155)
[05:43:04][Gradle failure report] at org.gradle.execution.plan.CompositeNodeGroup.isCanCancel(CompositeNodeGroup.java:101)
[05:43:04][Gradle failure report] at org.gradle.execution.plan.Node.isCanCancel(Node.java:232)
[05:43:04][Gradle failure report] at org.gradle.execution.plan.FinalizerGroup.isCanCancel(FinalizerGroup.java:155)
[05:43:04][Gradle failure report] at org.gradle.execution.plan.CompositeNodeGroup.isCanCancel(CompositeNodeGroup.java:101)
[05:43:04][Gradle failure report] at org.gradle.execution.plan.Node.isCanCancel(Node.java:232)
[05:43:04][Gradle failure report] at org.gradle.execution.plan.FinalizerGroup.isCanCancel(FinalizerGroup.java:155)
[05:43:04][Gradle failure report] at org.gradle.execution.plan.CompositeNodeGroup.isCanCancel(CompositeNodeGroup.java:101)
[05:43:04][Gradle failure report] at org.gradle.execution.plan.Node.isCanCancel(Node.java:232)
[05:43:04][Gradle failure report] at org.gradle.execution.plan.FinalizerGroup.isCanCancel(FinalizerGroup.java:155)
[05:43:04][Gradle failure report] at org.gradle.execution.plan.CompositeNodeGroup.isCanCancel(CompositeNodeGroup.java:101)
[05:43:04][Gradle failure report] at org.gradle.execution.plan.Node.isCanCancel(Node.java:232)
[05:43:04][Gradle failure report] at org.gradle.execution.plan.FinalizerGroup.isCanCancel(FinalizerGroup.java:155)
[05:43:04][Gradle failure report] at org.gradle.execution.plan.CompositeNodeGroup.isCanCancel(CompositeNodeGroup.java:101)
[05:43:04][Gradle failure report] at org.gradle.execution.plan.Node.isCanCancel(Node.java:232)
[05:43:04][Gradle failure report] at org.gradle.execution.plan.FinalizerGroup.isCanCancel(FinalizerGroup.java:155)
[05:43:04][Gradle failure report] at org.gradle.execution.plan.CompositeNodeGroup.isCanCancel(CompositeNodeGroup.java:101)
[05:43:04][Gradle failure report] at org.gradle.execution.plan.Node.isCanCancel(Node.java:232)
[05:43:04][Gradle failure report] at org.gradle.execution.plan.FinalizerGroup.isCanCancel(FinalizerGroup.java:155)
[05:43:04][Gradle failure report]
[05:43:04][Gradle failure report] ==============================================================================
[05:43:04][Gradle failure report]
[05:43:04][Gradle failure report] * Get more help at https://help.gradle.org
[05:43:04][Gradle failure report]
[05:43:04][Gradle failure report] BUILD FAILED in 1m 29s
[05:43:04][Step 1/1] Process exited with code 1 (Step: Build (Gradle))
[05:43:04][Step 1/1] Step Build (Gradle) failed
[05:43:04]Publishing internal artifacts
[05:43:04][Publishing internal artifacts] Publishing 1 file using [WebPublisher]
[05:43:04][Publishing internal artifacts] Publishing 1 file using [ArtifactsCachePublisherImpl]
[05:43:05]Publishing artifacts
[05:43:05][Publishing artifacts] Collecting files to publish: [build/distributions/Minecraft Development-*.zip]
[05:43:05][Publishing artifacts] Artifacts path 'build/distributions/Minecraft Development-*.zip' not found
[05:43:05]Build finished
×

×

Pin build

Cancel
×

Add build comment

Cancel
×

Promote Build

×

Add build comment

Cancel
×

Mute test

×

×

Server communication failure

Server is unavailable

Server stopped or communication with the server is not possible due to network failure.

Server shutdown started.

Please relogin to continue your work.

×

Run Custom Build

×

TODO

Loading related builds...
Cancel
×

Responsibility

×

Edit tags

Cancel
×

Loading...

×

Are you sure?

Cancel
×

Please type to confirm.
Cancel